Hexanoic acid, 3-hydroxy-, ethyl ester

Phase change data

Data compiled by: William E. Acree, Jr., James S. Chickos

Quantity Value Units Method Reference Comment
Δvap61.9 ± 0.6kJ/molCGCTemprado and Chickos, 2005Based on data from 363. - 393. K.

Kovats' RI, non-polar column, temperature ramp

View large format table.

Column type Active phase I Reference Comment
CapillaryDB-11103.Takeoka, Buttery, et al., 199260. m/0.32 mm/0.25 μm, He, 30. C @ 4. min, 2. K/min; Tend: 210. C
CapillaryDB-11103.Takeoka, Buttery, et al., 199260. m/0.32 mm/0.25 μm, He, 30. C @ 4. min, 2. K/min; Tend: 210. C

Kovats' RI, non-polar column, custom temperature program

View large format table.

Column type Active phase I Reference Comment
CapillaryDB-51122.Andrade, Santos, et al., 199830. m/0.25 mm/0.25 μm, He; Program: 40C => 2C/min => 60C => 4C/min => 260C

Van Den Dool and Kratz RI, non-polar column, temperature ramp

View large format table.

Column type Active phase I Reference Comment
CapillaryDB-11124.Osorio, Alarcon, et al., 200625. m/0.2 mm/0.33 μm, 4. K/min; Tstart: 50. C; Tend: 300. C
CapillaryHP-51136.Mahattanatawee, Goodner, et al., 200530. m/0.25 mm/0.25 μm, He, 50. C @ 5. min, 4. K/min, 250. C @ 15. min
CapillaryHP-5MS1133.Pino, Mesa, et al., 200530. m/0.25 mm/0.25 μm, He, 60. C @ 2. min, 4. K/min, 250. C @ 20. min
CapillaryDB-11140.Brat, Rega, et al., 200330. m/0.25 mm/0.25 μm, He, 3. K/min, 250. C @ 20. min; Tstart: 40. C
CapillaryUltra-21126.Ceva-Antunes, Bizzo, et al., 200325. m/0.25 mm/0.33 μm, H2, 40. C @ 2. min, 3. K/min, 280. C @ 10. min
CapillarySPB-51133.Pino, Marbot, et al., 200230. m/0.25 mm/0.25 μm, He, 60. C @ 2. min, 4. K/min, 250. C @ 20. min
CapillaryDB-5MS1126.Chassagne, Boulanger, et al., 199930. m/0.25 mm/0.25 μm, H2, 2. K/min; Tstart: 40. C; Tend: 200. C
CapillaryDB-51130.Moio L., Rillo L., et al., 199630. m/0.32 mm/1. μm, H2, 3. K/min; Tstart: 40. C; Tend: 220. C
CapillaryDB-11106.Wu, Kuo, et al., 199150. m/0.32 mm/1.05 μm, He, 2. K/min, 260. C @ 40. min; Tstart: 40. C

Van Den Dool and Kratz RI, non-polar column, custom temperature program

View large format table.

Column type Active phase I Reference Comment
CapillaryBPX-51133.Dharmawan, Kasapis, et al., 200730. m/0.25 mm/0.25 μm, He; Program: 35C => 4C/min => 200C => 30C/min => 300C (3min)
CapillaryDB-51129.Wang, Finn, et al., 200530. m/0.32 mm/1. μm, He; Program: 40C(2min) => 5C/min => 100C => 4C/min => 230C (10min)
CapillaryDB-51157.Wang, Finn, et al., 200530. m/0.32 mm/1. μm, He; Program: 40C(2min) => 5C/min => 100C => 4C/min => 230C (10min)
CapillaryDB-5MS1125.Boulanger and Crouzet, 200130. m/0.25 mm/0.25 μm, H2; Program: 40C (5min) => 2C/min => 200C => 5C/min => 250C (15min)
CapillaryDB-5MS1121.Boulanger and Crouzet, 200030. m/0.25 mm/0.25 μm, He; Program: 60 0C (3 min) 2 K/min -> 220 0C 5 K/min -> 250 0C (15 min)
CapillaryDB-5MS1126.Boulanger and Crouzet, 2000, 230. m/0.25 mm/0.25 μm, H2/N2; Program: 40C (5min) => 2C/min => 200C => 5C/min => 250C (15min)
CapillarySE-541134.Buettner and Schieberle, 199930. m/0.32 mm/0.25 μm, He; Program: 35C (2min) => 40C/min => 50C (2min) => 6C/min => 180C => 10C/min => 230C (10min)
CapillarySE-541134.Hinterholzer and Schieberie, 199830. m/0.32 mm/0.25 μm, He; Program: 35C(2min) => 40C/min => 50C(2min) => 6C/min => 180C => 10C/min => 230C(10min)

Van Den Dool and Kratz RI, polar column, temperature ramp

View large format table.

Column type Active phase I Reference Comment
CapillaryDB-Wax1664.Osorio, Alarcon, et al., 200630. m/0.25 mm/0.25 μm, He, 50. C @ 4. min, 4. K/min, 220. C @ 20. min
CapillaryDB-Wax1652.Brat, Rega, et al., 200330. m/0.25 mm/0.25 μm, He, 3. K/min, 250. C @ 20. min; Tstart: 40. C
CapillaryAT-Wax1661.Pino, Almora, et al., 200360. m/0.32 mm/0.25 μm, He, 65. C @ 10. min, 2. K/min, 250. C @ 60. min
CapillaryDB-Wax1670.Chassagne, Boulanger, et al., 199930. m/0.25 mm/0.25 μm, H2, 60. C @ 3. min, 2. K/min; Tend: 220. C
CapillaryDB-Wax1675.Umano, Hagi, et al., 1992He, 40. C @ 10. min, 2. K/min; Column length: 30. m; Column diameter: 0.25 mm; Tend: 200. C
CapillaryCarbowax 20M1664.Chen, Kuo, et al., 1982He, 50. C @ 10. min, 1. K/min; Tend: 160. C

Van Den Dool and Kratz RI, polar column, custom temperature program

View large format table.

Column type Active phase I Reference Comment
CapillaryStabilwax1690.Wang, Finn, et al., 200530. m/0.32 mm/1. μm, He; Program: 40C(2min) => 5C/min => 100C => 4C/min => 230C (10min)
CapillaryDB-Wax1663.Boulanger and Crouzet, 200030. m/0.25 mm/0.25 μm, H2; Program: 60 0C (3 min) 2 K/min -> 220 0C 5 K/min -> 250 0C (15 min)
CapillaryDB-Wax1664.Boulanger and Crouzet, 2000, 230. m/0.25 mm/0.25 μm, H2; Program: 60C(3min) => 2C/min => 220C => 5C/min => 250C (15min)
CapillaryFFAP1674.Buettner and Schieberle, 199930. m/0.32 mm/0.25 μm, He; Program: 35C (2min) => 40C/min => 60C (2min) => 6C/min => 180C => 10C/min => 230C (10min)

Normal alkane RI, non-polar column, temperature ramp

View large format table.

Column type Active phase I Reference Comment
CapillaryDB-51133.Xu, Fan, et al., 200730. m/0.32 mm/0.25 μm, He, 40. C @ 2. min, 4. K/min, 250. C @ 5. min
CapillaryDB-51130.Rouseff, Jella, et al., 200130. m/0.32 mm/0.5 μm, 6. K/min; Tstart: 35. C; Tend: 275. C
CapillaryDB-51130.Moio, Dekimpe, et al., 199330. m/0.32 mm/1. μm, H2, 3. K/min; Tstart: 40. C; Tend: 220. C
CapillaryDB-11104.Peppard, 199230. m/0.25 mm/1.0 μm, He, 3. K/min, 250. C @ 30. min; Tstart: 40. C
CapillaryDB-11104.Shiota, 199160. m/0.25 mm/0.25 μm, He, 3. K/min; Tstart: 50. C; Tend: 240. C
CapillaryDB-11106.Shiota, 199160. m/0.25 mm/0.25 μm, He, 3. K/min; Tstart: 50. C; Tend: 240. C
CapillaryDB-11103.Takeoka and Butter, 1989He, 30. C @ 4. min, 2. K/min; Column length: 60. m; Column diameter: 0.32 mm; Tend: 210. C
CapillaryDB-11105.Takeoka and Butter, 1989He, 30. C @ 4. min, 2. K/min; Column length: 60. m; Column diameter: 0.32 mm; Tend: 210. C

Normal alkane RI, non-polar column, custom temperature program

View large format table.

Column type Active phase I Reference Comment
CapillaryPolydimethyl siloxane with 5 % Ph groups1133.Robinson, Adams, et al., 2012Program: not specified
CapillaryPolydimethyl siloxane with 5 % Ph groups1137.Robinson, Adams, et al., 2012Program: not specified
CapillaryDB-51128.Miyazaki, Plotto, et al., 201160. m/0.25 mm/1.00 μm, Helium; Program: 40 0C 4 0C/min -> 230 0C 100 0C/min -> 260 0C (11.7 min)
CapillaryHP-5 MS1134.Fan, Lu, et al., 200930. m/0.25 mm/0.25 μm, Helium; Program: 40 0C (3 min) 3 0C/min -> 160 0C (2 min) 8 0C/min -> 220 0C (3 min)
CapillaryHP-5 MS1135.Fan, Lu, et al., 200930. m/0.25 mm/0.25 μm, Helium; Program: 40 0C (3 min) 3 0C/min -> 160 0C (2 min) 8 0C/min -> 220 0C (3 min)
CapillaryHP-51133.Qiao, Xie, et al., 200830. m/0.25 mm/0.25 μm, Helium; Program: 40 0C (3 min) 3 0C/min -> 160 0C (2 min) 8 0C/min -> 220 0C (3 min)
CapillaryHP-51133.Qiao, Xie, et al., 200830. m/0.25 mm/0.25 μm, Helium; Program: not specified
CapillaryHP-51136.Jordán, Goodner, et al., 200230. m/0.25 mm/0.25 μm; Program: not specified
CapillaryHP-51130.Jordán, Goodner, et al., 200230. m/0.25 mm/0.25 μm; Program: not specified

Normal alkane RI, polar column, temperature ramp

View large format table.

Column type Active phase I Reference Comment
CapillaryDB-Wax1677.Berlinet, Brat, et al., 200630. m/0.25 mm/0.25 μm, Helium, 3. K/min, 250. C @ 20. min; Tstart: 40. C
CapillaryDB-Wax1671.Parada, Duque, et al., 200030. m/0.25 mm/0.25 μm, He, 50. C @ 3. min, 4. K/min, 240. C @ 10. min
CapillaryDB-Wax1675.Parada, Duque, et al., 200030. m/0.25 mm/0.25 μm, He, 50. C @ 3. min, 4. K/min, 240. C @ 10. min
CapillaryDB-Wax1666.Parada and Duque, 199830. m/0.25 mm/0.25 μm, He, 50. C @ 3. min, 4. K/min, 240. C @ 10. min
CapillaryDB-Wax1675.Parada and Duque, 199830. m/0.25 mm/0.25 μm, He, 50. C @ 3. min, 4. K/min, 240. C @ 10. min
CapillaryDB-Wax1663.Morales, Albarracín, et al., 199630. m/0.25 mm/0.25 μm, He, 20. C @ 4. min, 4. K/min, 200. C @ 10. min
CapillaryDB-Wax1650.Morales, Albarracín, et al., 199630. m/0.25 mm/0.25 μm, He, 50. C @ 4. min, 4. K/min, 200. C @ 10. min

Normal alkane RI, polar column, custom temperature program

View large format table.

Column type Active phase I Reference Comment
CapillaryDB-Wax1674.Welke, Manfroi, et al., 201230. m/0.25 mm/0.25 μm, Helium; Program: not specified
CapillaryDB-Wax1675.Welke, Manfroi, et al., 201230. m/0.25 mm/0.25 μm, Helium; Program: not specified
CapillaryDB-Wax1696.Sampaio, Garruti, et al., 201130. m/0.25 mm/0.25 μm, Hydrogen; Program: 35 0C (9 min) 5 0C/min -> 80 0C 1 0C/min -> 100 0C 16 0C/min -> 210 0C (20 min)
CapillaryHP-Innowax1673.Quijano and Pino, 200660. m/0.25 mm/0.25 μm, Nitrogen; Program: 50 0C (4 min) -> 40 0C 4 0C/min -> 220 0C
CapillaryDB-Wax1677.Selli, Cabaroglu, et al., 200330. m/0.32 mm/0.5 μm, He; Program: 60C(2min) => 2C/min => 220C => 3C/min => 245C(20min)
CapillaryFFAP1674.Buettner and Schieberle, 200130. m/0.32 mm/0.25 μm, He; Program: 35C (2min) => 40C/min => 60C (2min) => 6C/min => 180C => 10C/min => 230C (10min)
CapillaryDB-Wax1670.Mayorga, Knapp, et al., 200130. m/0.25 mm/0.25 μm; Program: 50C(4min) => 4C/min => 130C => 1C/min => 190C => 4C/min => 220C(20min)
CapillaryDB-Wax1675.Mayorga, Knapp, et al., 200130. m/0.25 mm/0.25 μm; Program: 50C(4min) => 4C/min => 130C => 1C/min => 190C => 4C/min => 220C(20min)

References

Temprado and Chickos, 2005
Temprado, Manuel; Chickos, James S., Application of correlation-gas chromatography to evaluate the vaporization enthalpy of a component in an equilibrium mixture, Thermochimica Acta, 2005, 435, 1, 49-56, https://doi.org/10.1016/j.tca.2005.03.021 . [all data]

Takeoka, Buttery, et al., 1992
Takeoka, G.R.; Buttery, R.G.; Flath, R.A., Volatile constituents of Asian pear (Pyrus serotina), J. Agric. Food Chem., 1992, 40, 10, 1925-1929, https://doi.org/10.1021/jf00022a040 . [all data]

Andrade, Santos, et al., 1998
Andrade, E.H.A.; Santos, A.S.; Zoghbi, M.G.B.; Maia, J.G.S., Volatile constituents of fruits of Astrocarium vulgare Mart. and Bactris gasipaes H.B.K. (Arecaceae), Flavour Fragr. J., 1998, 13, 3, 151-153, https://doi.org/10.1002/(SICI)1099-1026(199805/06)13:3<151::AID-FFJ712>3.0.CO;2-E . [all data]

Osorio, Alarcon, et al., 2006
Osorio, C.; Alarcon, M.; Moreno, C.; Bonilla, A.; Barrios, J.; Garzon, C.; Duque, C., Characterization of Odor-Active Volatiles in Champa ( Campomanesia lineatifolia R. P.), J. Agric. Food Chem., 2006, 54, 2, 509-516, https://doi.org/10.1021/jf052098c . [all data]

Mahattanatawee, Goodner, et al., 2005
Mahattanatawee, K.; Goodner, K.L.; Baldwin, E.A., Volatile constituents and character impact compounds of selected Florida's tropical fruit, Proc. Fla. State Hort. Soc., 2005, 118, 414-418. [all data]

Pino, Mesa, et al., 2005
Pino, J.A.; Mesa, J.; Muñoz, Y.; Martí, M.P.; Marbot, R., Volatile components from mango (Mangifera indica L.) cultivars, J. Agric. Food Chem., 2005, 53, 6, 2213-2223, https://doi.org/10.1021/jf0402633 . [all data]

Brat, Rega, et al., 2003
Brat, P.; Rega, B.; Alter, P.; Reynes, M.; Brillouet, J.-M., Distribution of volatile compounds in the pulp, cloud, and serum of freshly squeezed orange juice, J. Agric. Food Chem., 2003, 51, 11, 3442-3447, https://doi.org/10.1021/jf026226y . [all data]

Ceva-Antunes, Bizzo, et al., 2003
Ceva-Antunes, P.M.N.; Bizzo, H.R.; Alves, S.M.; Antunes, O.A.C., Analysis of volatile compounds of taperebá (Spondias mombin L.) and Cajá (Spondias mombin L.) by simultaneous distillation and extraction (SDE) and solid phase microextraction (SPME), J. Agric. Food Chem., 2003, 51, 5, 1387-1392, https://doi.org/10.1021/jf025873m . [all data]

Pino, Marbot, et al., 2002
Pino, J.; Marbot, R.; Rosado, A., Volatile constituents of star apple (Chrysophyllum cainito L.) from Cuba, Flavour Fragr. J., 2002, 17, 5, 401-403, https://doi.org/10.1002/ffj.1116 . [all data]

Chassagne, Boulanger, et al., 1999
Chassagne, D.; Boulanger, R.; Crouzet, J., Enzymatic hydrolysis of edible Passiflora fruit glycosides, Food Chem., 1999, 66, 3, 281-288, https://doi.org/10.1016/S0308-8146(99)00044-8 . [all data]

Moio L., Rillo L., et al., 1996
Moio L.; Rillo L.; Ledda A.; Addeo F., Odorous constituents of ovine milk in relationship to diet, J. Dairy Sci., 1996, 79, 8, 1322-1331, https://doi.org/10.3168/jds.S0022-0302(96)76488-3 . [all data]

Wu, Kuo, et al., 1991
Wu, P.; Kuo, M.-C.; Hartman, T.G.; Rosen, R.T.; Ho, C.-T., Free and glycosidically bound aroma compounds in pineapple (Ananas comosus L. Merr.), J. Agric. Food Chem., 1991, 39, 1, 170-172, https://doi.org/10.1021/jf00001a033 . [all data]

Dharmawan, Kasapis, et al., 2007
Dharmawan, J.; Kasapis, S.; Curran, P.; Johnson, J.R., Characterization of volatile compounds in selected citrus fruits from Asia. Part I: freshly-squeezed juice, Flavour Fragr. J., 2007, 22, 3, 228-232, https://doi.org/10.1002/ffj.1790 . [all data]

Wang, Finn, et al., 2005
Wang, Y.; Finn, C.; Qian, M.C., Impact of Growing Environment on Chickasaw Blackberry ( Rubus L.) Aroma Evaluated by Gas Chromatography Olfactometry Dilution Analysis, J. Agric. Food Chem., 2005, 53, 9, 3563-3571, https://doi.org/10.1021/jf048102m . [all data]

Boulanger and Crouzet, 2001
Boulanger, R.; Crouzet, J., Identification of the aroma components of acerola (Malphigia glabra L.): free and bound flavor compounds, Food Chem., 2001, 74, 2, 209-216, https://doi.org/10.1016/S0308-8146(01)00128-5 . [all data]

Boulanger and Crouzet, 2000
Boulanger, R.; Crouzet, J., Free and bound flavour components of Amazonian fruits: 2. cupuacu volatile compounds, Flavour Fragr. J., 2000, 15, 4, 251-257, https://doi.org/10.1002/1099-1026(200007/08)15:4<251::AID-FFJ905>3.0.CO;2-2 . [all data]

Boulanger and Crouzet, 2000, 2
Boulanger, R.; Crouzet, J., Free and bound flavour components of Amazonian fruits: 3-glycosidically bound components of cupuacu, Food Chem., 2000, 70, 4, 463-470, https://doi.org/10.1016/S0308-8146(00)00112-6 . [all data]

Buettner and Schieberle, 1999
Buettner, A.; Schieberle, P., Characterization of the most odor-active volatiles in fresh, hand squeezed juice of grapefruit (Citrus paradise Macfayden), J. Agric. Food Chem., 1999, 47, 12, 5189-5193, https://doi.org/10.1021/jf990071l . [all data]

Hinterholzer and Schieberie, 1998
Hinterholzer, A.; Schieberie, P., Identification of the most odour-active volatiles in fresh, hand-extracted juice of valencia late oranges by odour dilution techniques, Flavour Fragr. J., 1998, 13, 1, 49-55, https://doi.org/10.1002/(SICI)1099-1026(199801/02)13:1<49::AID-FFJ691>3.0.CO;2-S . [all data]

Pino, Almora, et al., 2003
Pino, J.; Almora, K.; Marbot, R., Volatile components of papaya (Carica papaya L., maradol variety) fruit, Flavour Fragr. J., 2003, 18, 6, 492-496, https://doi.org/10.1002/ffj.1248 . [all data]

Umano, Hagi, et al., 1992
Umano, K.; Hagi, Y.; Nakahara, K.; Shoji, A.; Shibamoto, T., Volatile constituents of green and ripened pineapple (Aanas comosus [L.] Merr.), J. Agric. Food Chem., 1992, 40, 4, 599-603, https://doi.org/10.1021/jf00016a014 . [all data]

Chen, Kuo, et al., 1982
Chen, C.-C.; Kuo, M.-C.; Hwang, L.S.; Wu, J.S.-B.; Wu, C.-M., Headspace components of passion fruit juice, J. Agric. Food Chem., 1982, 30, 6, 1211-1215, https://doi.org/10.1021/jf00114a052 . [all data]

Xu, Fan, et al., 2007
Xu, Y.; Fan, W.; Qian, M.C., Characterization of Aroma Compounds in Apple Cider Using Solvent-Assisted Flavor Evaporation and Headspace Solid-Phase Microextraction, J. Agric. Food Chem., 2007, 55, 8, 3051-3057, https://doi.org/10.1021/jf0631732 . [all data]

Rouseff, Jella, et al., 2001
Rouseff, R.; Jella, P.; Bazemore, R.; Yang, J.-J., Aroma active internal standards for gas chromatography-olfactometry of grapefruit juices, Am. Chem. Soc. Symp. Ser., 2001, 782, 73-87. [all data]

Moio, Dekimpe, et al., 1993
Moio, L.; Dekimpe, J.; Etievant, P.; Addeo, F., Neutral volatile compounds in the raw milks from different species, J. Dairy Res., 1993, 60, 2, 199-213, https://doi.org/10.1017/S0022029900027515 . [all data]

Peppard, 1992
Peppard, T.L., Volatile flavor constituents of Monstera deliciosa, J. Agric. Food Chem., 1992, 40, 2, 257-262, https://doi.org/10.1021/jf00014a018 . [all data]

Shiota, 1991
Shiota, H., Volatile components of pawpaw fruit (Asimina triloba Dunal.), J. Agric. Food Chem., 1991, 39, 9, 1631-1635, https://doi.org/10.1021/jf00009a019 . [all data]

Takeoka and Butter, 1989
Takeoka, G.; Butter, R.G., Volatile constituents of pineapple (Ananas Comosus [L.] Merr.) in Flavor Chemistry. Trends and Developments, Teranishi,R.; Buttery,R.G.; Shahidi,F., ed(s)., American Chemical Society, Washington, DC, 1989, 223-237. [all data]

Robinson, Adams, et al., 2012
Robinson, A.L.; Adams, D.O.; Boss, P.K.; Heymann, H.; Solomon, P.S.; Trengove, R.D., Influence of geographic origine on the sensory characteristics and wine composition of Vitus viniferas cv. Cabernet Sauvignon wines from Australia (Supplemental data), Am. J. Enol. Vitic., 2012, 64, 4, 467-476, https://doi.org/10.5344/ajev.2012.12023 . [all data]

Miyazaki, Plotto, et al., 2011
Miyazaki, T.; Plotto, A.; Goodner, K.; Gmitter F.G., Distribution of aroma volatile compounds in tangerine hybrids and proposed inheritance, J. Sci. Food Agric., 2011, 91, 3, 449-460, https://doi.org/10.1002/jsfa.4205 . [all data]

Fan, Lu, et al., 2009
Fan, G.; Lu, W.; Yao, X.; Zhang, Y.; Wang, K.; Pan, S., effect of fermentation on free and bound volatile compounds of orange juice, Flavour Fragr. J., 2009, 24, 5, 219-229, https://doi.org/10.1002/ffj.1931 . [all data]

Qiao, Xie, et al., 2008
Qiao, Y.; Xie, B.J.; Zhang, Y.; Zhang, Y.; FAn, G.; Yao, X.L.; Pan, S.Y., Characterization of aroma active compounds in fruit juice and peel oil of Junchen sweet orange fruit (Citrus sinensis (L.) Osbeck) by GC-MS and GC-O, Molecules, 2008, 13, 6, 1333-1344, https://doi.org/10.3390/molecules13061333 . [all data]

Jordán, Goodner, et al., 2002
Jordán, M.J.; Goodner, K.L.; Shaw, P.E., Characterization of the aromatic profile in aqueous essence and fruit juice of yellow passion fruit (Passiflora edulis Sims F. Flavicarpa degner) by GC-MS and GC/O, J. Agric. Food Chem., 2002, 50, 6, 1523-1528, https://doi.org/10.1021/jf011077p . [all data]

Berlinet, Brat, et al., 2006
Berlinet, C.; Brat, P.; Brillouet, J.-M.; Ducruet, V., Ascorbic acid, aroma compounds and browning of orange juices related to PET packaging materials and pH, J. of the Sci., Food and Agriculture, 2006, 86, 13, 2206-2212, https://doi.org/10.1002/jsfa.2597 . [all data]

Parada, Duque, et al., 2000
Parada, F.; Duque, C.; Fujimoto, Y., Free and bound volatile composition and characterization of some glucoconjugates as aroma precursors in Melón de olor fruit pulp (Sicana odorifera), J. Agric. Food Chem., 2000, 48, 12, 6200-6204, https://doi.org/10.1021/jf0007232 . [all data]

Parada and Duque, 1998
Parada, F.; Duque, C., Studies on the aroma of piñuela fruit pulp (Bromelia plumieri): Free and bound volatile composition and characterization of some glucoconjugates as aroma precursors, J. Hi. Res. Chromatogr., 1998, 21, 10, 577-581, https://doi.org/10.1002/(SICI)1521-4168(19981001)21:10<577::AID-JHRC577>3.0.CO;2-V . [all data]

Morales, Albarracín, et al., 1996
Morales, A.L.; Albarracín, D.; Rodríguez, J.; Duque, C.; Riaño, L.E.; Espitia, J., Volatile constituents from Andes berry (Rubus glaucus Benth), J. Hi. Res. Chromatogr., 1996, 19, 10, 585-587, https://doi.org/10.1002/jhrc.1240191011 . [all data]

Welke, Manfroi, et al., 2012
Welke, J.E.; Manfroi, V.; Zanus, M.; Lazarotto, M.; Zini, C.A., Characterization of the volatile profile of Brazilian merlot wines through comprehensive two dimensional gas chromatography time-of-flight mass spectrometric detection, J. Chromatogr. A, 2012, 1226, 124-139, https://doi.org/10.1016/j.chroma.2012.01.002 . [all data]

Sampaio, Garruti, et al., 2011
Sampaio, K.S.; Garruti, D.S.; Franco, M.R.B.; Janzantti, N.S.; Da Silva, M.A.AP., Aroma volatiles recovered in the water phase of cashew apple (Anacardium occidentale L.) juice during concentration, J. Sci. Food Agric., 2011, 91, 10, 1801-1809, https://doi.org/10.1002/jsfa.4385 . [all data]

Quijano and Pino, 2006
Quijano, C.E.; Pino, J.A., Changes in volatile constituents during the ripening of cocona (Solanum sessiliflorum Dunal) fruit, Revista CENIC Ciencias Quimicas, 2006, 37, 3, 133-136. [all data]

Selli, Cabaroglu, et al., 2003
Selli, s.; Cabaroglu, T.; Canbas, A., Flavour components of orange wine made from a Turkish cv. Kozan, Int. J. Food Sci. Technol., 2003, 38, 5, 587-593, https://doi.org/10.1046/j.1365-2621.2003.00691.x . [all data]

Buettner and Schieberle, 2001
Buettner, A.; Schieberle, P., Application of a comparative aroma extract dilution analysis to monitor changes in orange juice aroma compounds during processing, Am. Chem. Soc. Symp. Ser., 2001, 782, 33-45. [all data]

Mayorga, Knapp, et al., 2001
Mayorga, H.; Knapp, H.; Winterhalter, P.; Duque, C., Glycosidically bound flavor compounds of cape gooseberry (Physalis peruviana L.), J. Agric. Food Chem., 2001, 49, 4, 1904-1908, https://doi.org/10.1021/jf0011743 . [all data]