Benzenepropanol, 4-hydroxy-3-methoxy-

Van Den Dool and Kratz RI, non-polar column, custom temperature program

View large format table.

Column type Active phase I Reference Comment
CapillaryHP-5MS1660.6Andriamaharavo, 201430. m/0.25 mm/0.25 μm, He; Program: 60C (1 min) => 5 C/min => 210C => 10 C/min => 280C (15 min)

Van Den Dool and Kratz RI, polar column, temperature ramp

View large format table.

Column type Active phase I Reference Comment
CapillaryDB-Wax2980.Aubert, Ambid, et al., 200330. m/0.32 mm/0.5 μm, 40. C @ 3. min, 3. K/min, 245. C @ 20. min
CapillaryDB-Wax2980.Aubert, Günata, et al., 200330. m/0.32 mm/0.5 μm, 40. C @ 3. min, 2. K/min, 245. C @ 20. min
CapillaryDB-Wax2969.Wirth, Guo, et al., 200130. m/0.32 mm/0.5 μm, He, 60. C @ 3. min, 3. K/min, 245. C @ 20. min
CapillaryDB-Wax2969.Bureau, Baumes, et al., 200030. m/0.32 mm/0.5 μm, He, 60. C @ 3. min, 3. K/min, 245. C @ 20. min
CapillaryDB-Wax2970.Bureau, Razungles, et al., 200030. m/0.32 mm/0.5 μm, 60. C @ 3. min, 3. K/min, 245. C @ 20. min
CapillaryCP-Wax 58CB2941.Pabst, Barron, et al., 199130. m/0.25 mm/0.22 μm, He, 3. K/min; Tstart: 40. C; Tend: 220. C

Van Den Dool and Kratz RI, polar column, custom temperature program

View large format table.

Column type Active phase I Reference Comment
CapillaryCarbowax 20M2970.Boido, Lloret, et al., 200325. m/0.32 mm/0.25 μm, H2; Program: 40C (8min) => 3C/min => 180C => 20C/min => 230C

Normal alkane RI, non-polar column, temperature ramp

View large format table.

Column type Active phase I Reference Comment
CapillaryDB-11597.Kjällstrand, Ramnäs, et al., 199830. m/0.25 mm/0.25 μm, He, 5. K/min; Tstart: 50. C; Tend: 200. C

References

Andriamaharavo, 2014
Andriamaharavo, N.R., Retention Data. NIST Mass Spectrometry Data Center., NIST Mass Spectrometry Data Center, 2014. [all data]

Aubert, Ambid, et al., 2003
Aubert, C.; Ambid, C.; Baumes, R.; Günata, Z., Investigation of bound aroma constituents of yellow-fleshed nectarines (Prunus persica L. Cv. Springbright). Changes in bound aroma profile during maturation, J. Agric. Food Chem., 2003, 51, 21, 6280-6286, https://doi.org/10.1021/jf034613h . [all data]

Aubert, Günata, et al., 2003
Aubert, C.; Günata; Ambid, C.; Baumes, R., Changes in physicochemical characteristics and volatile constituents of yellow- and white-fleshed nectarines during maturation and artificial ripening, J. Agric. Food Chem., 2003, 51, 10, 3083-3091, https://doi.org/10.1021/jf026153i . [all data]

Wirth, Guo, et al., 2001
Wirth, J.; Guo, W.; Baumes, R.; Günata, Z., Volatile compounds released by enzymatic hydrolysis of glycoconjugates of leaves and grape berries from Vitis vinifera muscat of Alexandria and Shiraz cultivars, J. Agric. Food Chem., 2001, 49, 6, 2917-2923, https://doi.org/10.1021/jf001398l . [all data]

Bureau, Baumes, et al., 2000
Bureau, S.M.; Baumes, R.L.; Razungles, A.J., Effects of vine or bunch shading on the glycosylated flavor precursors in grapes of Vitis vinifera L. Cv. Syrah, J. Agric. Food Chem., 2000, 48, 4, 1290-1297, https://doi.org/10.1021/jf990507x . [all data]

Bureau, Razungles, et al., 2000
Bureau, S.M.; Razungles, A.R.; Baumes, R.L., The aroma of Muscat of Frontignan grapes: effect of the light environment of vine or bunch on volatiles and glycoconjugates, J. Sci. Food Agric., 2000, 80, 14, 2012-2020, https://doi.org/10.1002/1097-0010(200011)80:14<2012::AID-JSFA738>3.0.CO;2-X . [all data]

Pabst, Barron, et al., 1991
Pabst, A.; Barron, D.; Etiévant, P.; Schreier, P., Studies on the enzymatic hydrolysis of bound aroma constituents from raspberry fruit pulp, J. Agric. Food Chem., 1991, 39, 1, 173-175, https://doi.org/10.1021/jf00001a034 . [all data]

Boido, Lloret, et al., 2003
Boido, E.; Lloret, A.; Medina, K.; Fariña, L.; Carrau, f.; Versini, G.; Dellacassa, E., Aroma composition of Vitis vinifera Cv. Tannat: the typical red wine from Uruguay, J. Agric. Food Chem., 2003, 51, 18, 5408-5413, https://doi.org/10.1021/jf030087i . [all data]

Kjällstrand, Ramnäs, et al., 1998
Kjällstrand, J.; Ramnäs, O.; Petersson, G., Gas chromatographic and mass spectrometric analysis of 36 lignin-related methoxyphenols from uncontrolled combustion of wood, J. Chromatogr. A, 1998, 824, 2, 205-210, https://doi.org/10.1016/S0021-9673(98)00698-0 . [all data]