γ-Dodecalactone

Van Den Dool and Kratz RI, polar column, temperature ramp

Data compiled by: NIST Mass Spectrometry Data Center, William E. Wallace, director

Column type CapillaryCapillaryCapillaryCapillaryCapillary
Active phase DB-Wax EtrFFAPDB-Wax EtrDB-WaxDB-Wax
Column length (m) 30.30.30.60.30.
Carrier gas  HeHeH2
Substrate
Column diameter (mm) 0.250.320.250.250.25
Phase thickness (μm) 0.25 0.250.250.25
Tstart (C) 40.40.40.30.40.
Tend (C) 250.240.250.230.200.
Heat rate (K/min) 5.8.5.3.10.
Initial hold (min) 3.2.3.2.5.
Final hold (min) 15.5.15.4.15.
I 2372.2415.2372.2381.2366.
ReferenceAubert and Chanforan, 2007Schlutt B., Moran N., et al., 2007Aubert C. and Pitrat M., 2006Schwambach and Peterson, 2006Avsar, Karagul-Yuceer, et al., 2004
Comment MSDC-RI MSDC-RI MSDC-RI MSDC-RI MSDC-RI
Column type CapillaryCapillaryCapillaryCapillaryCapillary
Active phase DB-WaxDB-FFAPZB-WaxDB-WaxDB-Wax Etr
Column length (m) 30.15.30.30.30.
Carrier gas  HeHeHeHe
Substrate
Column diameter (mm) 0.250.320.250.250.25
Phase thickness (μm) 0.250.250.150.50.25
Tstart (C) 40.35.35.40.40.
Tend (C) 200.225.220.230.245.
Heat rate (K/min) 10.10.5.5.3.
Initial hold (min) 5.5.5.2.3.
Final hold (min) 15.15.10.10.20.
I 2366.2380.2367.2384.2357.
ReferenceAvsar, Karagul-Yuceer, et al., 2004Avsar, Karagul-Yuceer, et al., 2004Ledauphin, Saint-Clair, et al., 2004Mahajan, Goddik, et al., 2004Ménager, Jost, et al., 2004
Comment MSDC-RI MSDC-RI MSDC-RI MSDC-RI MSDC-RI
Column type CapillaryCapillaryCapillaryCapillaryCapillary
Active phase DB-FFAPDB-WaxDB-WaxDB-FFAPDB-Wax
Column length (m) 30.30.30.30.30.
Carrier gas He
Substrate
Column diameter (mm) 0.250.320.250.250.25
Phase thickness (μm) 0.250.50.250.250.25
Tstart (C) 35.40.35.35.35.
Tend (C) 200.240.200.200.200.
Heat rate (K/min) 10.7.10.10.10.
Initial hold (min) 5. 5.5.5.
Final hold (min) 30.5.30.30.30.
I 2376.2399.2384.2353.2398.
ReferenceKaragül-Yüceer, Vlahovich, et al., 2003Valim, Rouseff, et al., 2003Karagül-Yüceer, Cadwallader, et al., 2002Karagül-Yüceer, Cadwallader, et al., 2002Karagül-Yüceer, Drake, et al., 2001
Comment MSDC-RI MSDC-RI MSDC-RI MSDC-RI MSDC-RI
Column type CapillaryCapillaryCapillaryCapillaryCapillary
Active phase AT-WaxDB-WaxDB-WaxDB-WaxDB-Wax
Column length (m) 60.60.30.60.30.
Carrier gas HeHeHeHeHe
Substrate
Column diameter (mm) 0.320.250.250.250.25
Phase thickness (μm) 0.250.250.250.25
Tstart (C) 65.50.20.50.40.
Tend (C) 250.230.200.230.200.
Heat rate (K/min) 2.2.4.2.2.
Initial hold (min) 10. 5. 10.
Final hold (min) 60.60.10.60.
I 2333.2397.2368.2409.2357.
ReferencePino and Marbot, 2001Shimoda, Yoshimura, et al., 2001Ott, Fay, et al., 1997Shiratsuchi, Shimoda, et al., 1994Umano, Hagi, et al., 1992
Comment MSDC-RI MSDC-RI MSDC-RI MSDC-RI MSDC-RI

Van Den Dool and Kratz RI, non-polar column, temperature ramp

Data compiled by: NIST Mass Spectrometry Data Center, William E. Wallace, director

Column type CapillaryCapillaryCapillaryCapillaryCapillary
Active phase SPB-5SE-54DB-5MSBPX-5HP-5MS
Column length (m) 60.50.60.25.30.
Carrier gas  HeH2HeHe
Substrate
Column diameter (mm) 0.320.320.250.250.25
Phase thickness (μm) 1. 0.250.250.25
Tstart (C) 40.40.30.50.60.
Tend (C) 230.240.250.300.250.
Heat rate (K/min) 3.8.2.5.4.
Initial hold (min) 2.2.2.5.2.
Final hold (min) 10.5.2. 20.
I 1695.1680.1677.1699.1675.
ReferenceEngel and Ratel, 2007Schlutt B., Moran N., et al., 2007Schwambach and Peterson, 2006Dickschat J.S., Wagner-Dobler I., et al., 2005Pino, Mesa, et al., 2005
Comment MSDC-RI MSDC-RI MSDC-RI MSDC-RI MSDC-RI
Column type CapillaryCapillaryCapillaryCapillaryCapillary
Active phase DB-5DB-5SPB-5DB-5MSDB-1
Column length (m) 30.30.30.30.30.
Carrier gas   HeHeHe
Substrate
Column diameter (mm) 0.250.250.250.250.25
Phase thickness (μm) 0.250.250.250.250.25
Tstart (C) 40.40.60.35.40.
Tend (C) 200.200.250.200.325.
Heat rate (K/min) 10.10.4.10.3.
Initial hold (min) 5.5.2.5.
Final hold (min) 15.15.20.30.
I 1668.1668.1663.1680.1627.3
ReferenceAvsar, Karagul-Yuceer, et al., 2004Avsar, Karagul-Yuceer, et al., 2004Píno, Marbot, et al., 2004Karagül-Yüceer, Vlahovich, et al., 2003Sun and Stremple, 2003
Comment MSDC-RI MSDC-RI MSDC-RI MSDC-RI MSDC-RI
Column type CapillaryCapillaryCapillaryCapillaryCapillary
Active phase DB-5DB-5DB-5CP Sil 5 CBHP-5
Column length (m) 60.30.30.50.30.
Carrier gas He  HeHe
Substrate
Column diameter (mm) 0.250.320.320.320.25
Phase thickness (μm) 0.250.250.250.4
Tstart (C) 40.35.35.60.50.
Tend (C) 275.200.200.280.200.
Heat rate (K/min) 7.10.10.3.4.
Initial hold (min)  5.5.10.1.
Final hold (min)  30.30.60.
I 1685.1653.1656.1640.1673.
ReferenceValim, Rouseff, et al., 2003Karagül-Yüceer, Cadwallader, et al., 2002Karagül-Yüceer, Drake, et al., 2001Pino and Marbot, 2001Shalit, Katzir, et al., 2001
Comment MSDC-RI MSDC-RI MSDC-RI MSDC-RI MSDC-RI
Column type CapillaryPacked
Active phase DB-5OV-101
Column length (m) 30.2.5
Carrier gas He
Substrate  Gas-Chrom Q
Column diameter (mm) 0.25
Phase thickness (μm)
Tstart (C) 50.50.
Tend (C) 250.220.
Heat rate (K/min) 4.2.
Initial hold (min)
Final hold (min)
I 1656.1720.
ReferenceGómez, Ledbetter, et al., 1993Nixon, Wong, et al., 1979
Comment MSDC-RI MSDC-RI

Van Den Dool and Kratz RI, polar column, custom temperature program

Data compiled by: NIST Mass Spectrometry Data Center, William E. Wallace, director

Column type CapillaryCapillary
Active phase FFAPFFAP
Column length (m) 30.30.
Carrier gas HeHe
Substrate
Column diameter (mm) 0.320.32
Phase thickness (μm) 0.250.25
Program 35C (2min) => 40C/min => 60C => 4C/min => 230C (10min)35C (2min) => 40C/min => 60C => 4C/min => 230C (10min)
I 2370.2370.
ReferenceDerail, Hofmann, et al., 1999Derail, Hofmann, et al., 1999
Comment MSDC-RI MSDC-RI

Kovats' RI, non-polar column, temperature ramp

View large format table.

Column type Active phase I Reference Comment
CapillaryDB-11633.Takeoka, Perrino, et al., 199660. m/0.25 mm/0.25 μm, 30. C @ 4. min, 2. K/min; Tend: 220. C
CapillaryDB-11636.Takeoka, Perrino, et al., 199660. m/0.25 mm/0.25 μm, 30. C @ 4. min, 2. K/min; Tend: 220. C
CapillaryDB-11631.Takeoka, Flath, et al., 199060. m/0.32 mm/0.25 μm, He, 30. C @ 4. min, 2. K/min; Tend: 210. C
CapillaryDB-11635.Takeoka, Flath, et al., 199060. m/0.32 mm/0.25 μm, He, 30. C @ 4. min, 2. K/min; Tend: 210. C
CapillaryDB-11632.Takeoka, Flath, et al., 199060. m/0.32 mm/0.25 μm, He, 30. C @ 4. min, 2. K/min; Tend: 210. C
CapillaryDB-11635.Takeoka, Flath, et al., 199060. m/0.32 mm/0.25 μm, He, 30. C @ 4. min, 2. K/min; Tend: 210. C

Kovats' RI, non-polar column, custom temperature program

View large format table.

Column type Active phase I Reference Comment
CapillarySPB-11630.Riu-Aumatell, Castellari, et al., 200430. m/0.25 mm/0.25 μm; Program: not specified
CapillaryDB-5MS1673.Maia, Andrade, et al., 200030. m/0.25 mm/0.25 μm, He; Program: 40C => 2C/min => 60C => 4C/min => 260C
CapillaryDB-51671.Andrade, Santos, et al., 199830. m/0.25 mm/0.25 μm, He; Program: 40C => 2C/min => 60C => 4C/min => 260C

Kovats' RI, polar column, temperature ramp

View large format table.

Column type Active phase I Reference Comment
CapillaryDB-Wax2365.Umano, Hagi, et al., 1994He, 40. C @ 2. min, 2. K/min; Column length: 60. m; Column diameter: 0.25 mm; Tend: 200. C
CapillaryCarbowax 20M2345.Spencer, Pangborn, et al., 1978N2, 3. K/min; Column length: 30. m; Column diameter: 0.26 mm; Tstart: 70. C; Tend: 170. C
CapillaryCarbowax 20M2348.Spencer, Pangborn, et al., 1978N2, 3. K/min; Column length: 30. m; Column diameter: 0.26 mm; Tstart: 70. C; Tend: 170. C

Van Den Dool and Kratz RI, non-polar column, custom temperature program

View large format table.

Column type Active phase I Reference Comment
CapillaryVF-5MS1689.Carasek and Pawliszyn, 200630. m/0.25 mm/0.25 μm, He; Program: 40C(2min) => 5C/min => 200C (2min) => 30C/min => 260C
CapillarySE-541677.Derail, Hofmann, et al., 199930. m/0.32 mm/0.25 μm, He; Program: 35C (2min) => 40C/min => 50C => 4C/min => 230C (10min)

Normal alkane RI, non-polar column, temperature ramp

View large format table.

Column type Active phase I Reference Comment
CapillaryHP-5 MS1684.Lazarevic, Radulovic, et al., 201030. m/0.25 mm/0.25 μm, Helium, 5. K/min; Tstart: 70. C; Tend: 290. C
CapillarySE-541684.Laselan, Buettner, et al., 200930. m/0.32 mm/0.25 μm, 0. C @ 2. min, 6. K/min; Tend: 200. C
CapillaryBPX-51698.Dickschat, Martens, et al., 200525. m/0.22 mm/0.25 μm, He, 50. C @ 5. min, 5. K/min; Tend: 320. C
CapillaryHP-5MS1647.Tesevic, Nikicevic, et al., 200530. m/0.25 mm/0.25 μm, He, 4.3 K/min; Tstart: 60. C; Tend: 285. C
CapillaryHP-51684.Bicalho, Pereira, et al., 200030. m/0.25 mm/0.25 μm, H2, 40. C @ 10. min, 3. K/min, 280. C @ 10. min
CapillaryDB-5 MS1681.Gomez and Ledbetter, 1994Helium, 4. K/min; Column length: 30. m; Column diameter: 0.25 mm; Tstart: 50. C; Tend: 250. C
CapillaryDB-11631.Takeoka and Butter, 1989He, 30. C @ 4. min, 2. K/min; Column length: 60. m; Column diameter: 0.32 mm; Tend: 210. C
CapillaryDB-11635.Takeoka and Butter, 1989He, 30. C @ 4. min, 2. K/min; Column length: 60. m; Column diameter: 0.32 mm; Tend: 210. C
CapillaryDB-11636.Engel, Flath, et al., 198860. m/0.315 mm/0.25 μm, He, 4. K/min; Tstart: 50. C; Tend: 250. C

Normal alkane RI, non-polar column, custom temperature program

View large format table.

Column type Active phase I Reference Comment
CapillarySE-541682.Christlbauer and Schieberle, 200930. m/0.32 mm/0.25 μm, Helium; Program: 35 0C (2 min) 10 0C/min -> 50 0C (2 min) 6 0C/min -> 250 0C
CapillaryCP-Sil 5 Cb1655.Collin, Nizet, et al., 200850. m/0.32 mm/1.20 μm, Nitrogen; Program: 40 0C 20 0C/min -> 85 0C 1 0C/min -> 145 0C 3 0C/min -> 250 0C (30 min)
CapillaryDB-5 MS1691.Watanabe, Ueda, et al., 200830. m/0.32 mm/1.0 μm, Helium; Program: -10 0C (3 min) 50 0C/min -> 40 0C 5 0C/min -> 290 0C (5 min)
CapillaryHP-5 MS1684.Xie, Sun, et al., 200830. m/0.25 mm/0.25 μm, Helium; Program: 40 0C (2 min) 4 0C/min -> 220 0C 20 0C/min -> 280 0C
CapillaryDB-51678.Tokitomo, Steihaus, et al., 200530. m/0.32 mm/0.25 μm, Helium; Program: 40 0C (2 min) 40 0C/min -> 60 0C (2 min) 6 0C/min -> 180 0C 10 0C/min -> 240 0C (5 min)
CapillarySE-301647.Vinogradov, 2004Program: not specified
CapillaryHP-5MS1682.Ansorena, Gimeno, et al., 200130. m/0.25 mm/0.25 μm, He; Program: 40C (10min) => 3C/min => 120C => 10C/min => 250C (5min)
CapillaryHP-11634.Teai, Claude-Lafontaine, et al., 200150. m/0.32 mm/0.52 μm, N2; Program: 40C => 2C/min => 130C => 4C/min => 250C
CapillarySE-541663.Schermann and Schieberle, 199730. m/0.32 mm/0.25 μm, He; Program: 35C (2min) => 40C/min => 60C (2min) => 6C/min => 180C => 10C/min => 240C
CapillarySE-541663.Schermann and Schieberle, 199730. m/0.32 mm/0.25 μm, He; Program: 35C (2min) => 40C/min => 60C (2min) => 6C/min => 180C => 10C/min => 240C
CapillaryMethyl Silicone1645.Grundschober, 1991Program: not specified

Normal alkane RI, polar column, temperature ramp

View large format table.

Column type Active phase I Reference Comment
CapillaryFFAP2384.Christlbauer and Schieberle, 200930. m/0.32 mm/0.25 μm, Helium, 40. C @ 2. min, 6. K/min; Tend: 240. C
CapillaryDB-FFAP2376.Laselan, Buettner, et al., 200930. m/0.32 mm/0.25 μm, 0. C @ 2. min, 6. K/min; Tend: 200. C
CapillaryInnowax2376.Kaypak and Avsar, 200830. m/0.25 mm/0.25 μm, 40. C @ 5. min, 10. K/min, 200. C @ 15. min
CapillaryCP Wax 52 CB2343.Chen, Chyau, et al., 200760. m/0.25 mm/0.25 μm, Helium, 3. K/min; Tstart: 40. C; Tend: 220. C
CapillaryCarbowax 20M2396.Kafkas and Paydas, 200725. m/0.25 mm/0.40 μm, Helium, 5. K/min, 260. C @ 40. min; Tstart: 60. C
CapillaryDB-Wax2365.Fan and Qian, 200630. m/0.32 mm/0.25 μm, He, 40. C @ 2. min, 4. K/min, 230. C @ 15. min
CapillaryDB-Wax2371.López, Ezpeleta, et al., 200460. m/0.25 mm/0.25 μm, He, 40. C @ 5. min, 3. K/min; Tend: 220. C
CapillaryCarbowax 20M2367.Saura, LAencina, et al., 2003Helium, 50. C @ 2. min, 4. K/min; Column length: 50. m; Column diameter: 0.70 mm; Tend: 280. C
CapillaryEC-10002395.Bendall, 200130. m/0.25 mm/0.25 μm, He, 35. C @ 5. min, 5. K/min, 230. C @ 15. min
CapillaryDB-Wax2360.Weckerle, Bastl-Borrmann, et al., 200130. m/0.25 mm/0.25 μm, He, 50. C @ 3. min, 4. K/min; Tend: 220. C
CapillaryDB-Wax2411.Iwatsuki, Mizota, et al., 19994. K/min; Column length: 30. m; Column diameter: 0.53 mm; Tstart: 60. C; Tend: 210. C
CapillaryDB-Wax2402.Iwatsuki, Mizota, et al., 19994. K/min; Column length: 30. m; Column diameter: 0.53 mm; Tstart: 60. C; Tend: 210. C
CapillaryTC-Wax2399.Shuichi, Masazumi, et al., 199680. C @ 5. min, 3. K/min; Column length: 60. m; Column diameter: 0.25 mm; Tend: 240. C
CapillaryDB-Wax2379.Engel, Flath, et al., 198860. m/0.322 mm/0.25 μm, He, 4. K/min; Tstart: 50. C; Tend: 230. C
CapillaryDB-Wax2354.Takeoka, Flath, et al., 198860. m/0.25 mm/0.25 μm, H2, 30. C @ 2. min, 2. K/min; Tend: 180. C
CapillaryDB-Wax2355.Takeoka, Flath, et al., 198860. m/0.25 mm/0.25 μm, H2, 30. C @ 2. min, 2. K/min; Tend: 180. C

Normal alkane RI, polar column, custom temperature program

View large format table.

Column type Active phase I Reference Comment
CapillaryEC-10002395.Delabre and Bendall, 9999Program: not specified
CapillaryDB-Wax2399.Sampaio, Garruti, et al., 201130. m/0.25 mm/0.25 μm, Hydrogen; Program: 35 0C (9 min) 5 0C/min -> 80 0C 1 0C/min -> 100 0C 16 0C/min -> 210 0C (20 min)
CapillaryHP Innowax FSP2396.Tabanca N., Demirci B., et al., 200760. m/0.25 mm/0.25 μm, N2; Program: 60C(10min) => 4C/min => 220C(10min) => 1C/min => 240C
CapillaryCP-Wax 58CB2333.Tokitomo, Steihaus, et al., 200525. m/0.32 mm/0.20 μm, Helium; Program: 40 0C (2 min) 40 0C/min -> 60 0C (1 min) 6 0C/min -> 180 0C 10 0C/min -> 240 0C (5 min)
CapillaryCarbowax 20M2379.Saura, LAencina, et al., 2003Helium; Column length: 50. m; Column diameter: 0.70 mm; Program: not specified
CapillaryFFAP2369.Guth and Grosch, 1993Program: not specified
CapillaryPolyethylene Glycol2379.Grundschober, 1991Program: not specified

References

Aubert and Chanforan, 2007
Aubert, C.; Chanforan, C., Postharvest Changes in Physicochemical Properties and Volatile Constituents of Apricot (Prunus armeniaca L.). Characterization of 28 Cultivars, J. Agric. Food Chem., 2007, 55, 8, 3074-3082, https://doi.org/10.1021/jf063476w . [all data]

Schlutt B., Moran N., et al., 2007
Schlutt B.; Moran N.; Schieberle P.; Hofmann T., Sensory-directed identification of creaminess-enhancing volatiles and semivolatiles in full-fat cream, J. Agric. Food Chem., 2007, 55, 23, 9634-9645, https://doi.org/10.1021/jf0721545 . [all data]

Aubert C. and Pitrat M., 2006
Aubert C.; Pitrat M., Volatile compounds in the skin and pulp of Queen Anne's pocket melon, J. Agric. Food Chem., 2006, 54, 21, 8177-8182, https://doi.org/10.1021/jf061415s . [all data]

Schwambach and Peterson, 2006
Schwambach, S.L.; Peterson, D.G., Reduction of Stale Flavor Development in Low-Heat Skim Milk Powder via Epicatechin Addition, J. Agric. Food Chem., 2006, 54, 2, 502-508, https://doi.org/10.1021/jf0519764 . [all data]

Avsar, Karagul-Yuceer, et al., 2004
Avsar, Y.K.; Karagul-Yuceer, Y.; Drake, M.A.; Singh, T.K.; Yoon, Y.; Cadwallader, K.R., Characterization of nutty flavor in cheddar cheese, J. Dairy Sci., 2004, 87, 7, 1999-2010, https://doi.org/10.3168/jds.S0022-0302(04)70017-X . [all data]

Ledauphin, Saint-Clair, et al., 2004
Ledauphin, J.; Saint-Clair, J.-F.; Lablanquie, O.; Guichard, H.; Founier, N.; Guichard, E.; Barillier, D., Identification of trace volatile compounds in freshly distilled calvados and cognac using preparative separations coupled with gas chromatography-mass spectrometry, J. Agric. Food Chem., 2004, 52, 16, 5124-5134, https://doi.org/10.1021/jf040052y . [all data]

Mahajan, Goddik, et al., 2004
Mahajan, S.S.; Goddik, L.; Qian, M.C., Aroma Compounds in Sweet Whey Powder, J. Dairy Sci., 2004, 87, 12, 4057-4063, https://doi.org/10.3168/jds.S0022-0302(04)73547-X . [all data]

Ménager, Jost, et al., 2004
Ménager, I.; Jost, M.; Aubert, C., Changes in physicochemical characteristics and volatile constituents of strawberry (Cv. Cigaline) during maturation, J. Agric. Food Chem., 2004, 52, 5, 1248-1254, https://doi.org/10.1021/jf0350919 . [all data]

Karagül-Yüceer, Vlahovich, et al., 2003
Karagül-Yüceer, Y.; Vlahovich, K.N.; Drake, M.A.; Cadwallader, K.R., Characteristic aroma components of rennet casein, J. Agric. Food Chem., 2003, 51, 23, 6797-6801, https://doi.org/10.1021/jf0345806 . [all data]

Valim, Rouseff, et al., 2003
Valim, M.F.; Rouseff, R.L.; Lin, J., Gas chromatographic-olfactometric characterization of aroma compounds in two types of cashew apple nectar, J. Agric. Food Chem., 2003, 51, 4, 1010-1015, https://doi.org/10.1021/jf025738+ . [all data]

Karagül-Yüceer, Cadwallader, et al., 2002
Karagül-Yüceer, Y.; Cadwallader, K.R.; Drake, M.A., Volatile flavor components of stored nonfat dry milk, J. Agric. Food Chem., 2002, 50, 2, 305-312, https://doi.org/10.1021/jf010648a . [all data]

Karagül-Yüceer, Drake, et al., 2001
Karagül-Yüceer, Y.; Drake, M.; Cadwallader, K.R., Aroma-active components of nonfat dry milk, J. Agric. Food Chem., 2001, 49, 6, 2948-2953, https://doi.org/10.1021/jf0009854 . [all data]

Pino and Marbot, 2001
Pino, J.A.; Marbot, R., Volatile flavor constituents of acerola (Malpighia emarginata DC.) fruit, J. Agric. Food Chem., 2001, 49, 12, 5880-5882, https://doi.org/10.1021/jf010270g . [all data]

Shimoda, Yoshimura, et al., 2001
Shimoda, M.; Yoshimura, Y.; Yoshimura, T.; Noda, K.; Osajima, Y., Volatile flavor compounds of sweetened condensed milk, J. Food Sci., 2001, 66, 6, 804-807, https://doi.org/10.1111/j.1365-2621.2001.tb15176.x . [all data]

Ott, Fay, et al., 1997
Ott, A.; Fay, L.B.; Chaintreau, A., Determination and origin of the aroma impact compounds of yogurt flavor, J. Agric. Food Chem., 1997, 45, 3, 850-858, https://doi.org/10.1021/jf960508e . [all data]

Shiratsuchi, Shimoda, et al., 1994
Shiratsuchi, H.; Shimoda, M.; Imayoshi, K.; Noda, K.; Osajima, Y., Volatile flavor compounds in spray-dried skim milk powder, J. Agric. Food Chem., 1994, 42, 4, 984-988, https://doi.org/10.1021/jf00040a028 . [all data]

Umano, Hagi, et al., 1992
Umano, K.; Hagi, Y.; Nakahara, K.; Shoji, A.; Shibamoto, T., Volatile constituents of green and ripened pineapple (Aanas comosus [L.] Merr.), J. Agric. Food Chem., 1992, 40, 4, 599-603, https://doi.org/10.1021/jf00016a014 . [all data]