1,7-Phenanthroline

Phase change data

Data compiled by: William E. Acree, Jr., James S. Chickos

Quantity Value Units Method Reference Comment
Δvap19.0 ± 1.1kcal/molCGCLipkind and Chickos, 2009See also Lipkind, Hanshaw, et al., 2009.

References

Lipkind and Chickos, 2009
Lipkind, D.; Chickos, J.S., , Abstract from 38th Great Lakes Regional Meeting of the American Chemical Society, May 13-16, Chicago, IL, 2009, GLRM-275. [all data]

Lipkind, Hanshaw, et al., 2009
Lipkind, Dmitri; Hanshaw, William; Chickos, James S., Hypothetical Thermodynamic Properties. Subcooled Vaporization Enthalpies and Vapor Pressures of Polyaromatic Heterocycles and Related Compounds, J. Chem. Eng. Data, 2009, 54, 10, 2930-2943, https://doi.org/10.1021/je900034d . [all data]