2-Selenophenecarboxylic acid

Gas phase ion energetics data

Data compiled as indicated in comments:
LBLHLM - Sharon G. Lias, John E. Bartmess, Joel F. Liebman, John L. Holmes, Rhoda D. Levin, and W. Gary Mallard
LLK - Sharon G. Lias, Rhoda D. Levin, and Sherif A. Kafafi

Ionization energy determinations

IE (eV) Method Reference Comment
8.9PEReineck, Nohre, et al., 1983LBLHLM
9.3 ± 0.1EIDistefano, Pignataro, et al., 1973LLK
9.08PEReineck, Nohre, et al., 1983Vertical value; LBLHLM
9.19 ± 0.05PEFringuelli, Marino, et al., 1976Vertical value; LLK

References

Reineck, Nohre, et al., 1983
Reineck, I.; Nohre, C.; Lodin, P.; Maripuu, R.; Lindberg, B.; Karlsson, L.; Siegbahn, K.; Hornfeldt, A.-B.; Gronowitz, S., Electronic and vibrational structure of 2-substituted selenophenes studied by He(I) photoelectron spectroscopy, Chem. Scr., 1983, 22, 209. [all data]

Distefano, Pignataro, et al., 1973
Distefano, G.; Pignataro, S.; Innorta, G.; Fringuelli, F.; Marino, G.; Taticchi, A., Ionization energies of selenophen, tellurophen and some of their derivatives, Chem. Phys. Lett., 1973, 22, 132. [all data]

Fringuelli, Marino, et al., 1976
Fringuelli, F.; Marino, G.; Taticchi, A.; Distefano, G.; Colonna, F.P.; Pignataro, S., Photoelectron spectra of the α-substituted derivatives of furan, thiophen, selenophen, and tellurophen. A comparative study of the molecular orbital energies, J. Chem. Soc. Perkin Trans. 2, 1976, 276. [all data]