Pyridine, 2-pentyl-

Van Den Dool and Kratz RI, polar column, custom temperature program

Data compiled by: NIST Mass Spectrometry Data Center, William E. Wallace, director

Column type CapillaryCapillary
Active phase EC-WAXEC-WAX
Column length (m) 30.30.
Carrier gas HeHe
Substrate
Column diameter (mm) 0.320.32
Phase thickness (μm) 0.250.25
Program  40C(5min) => 3C/min => 165C => 20C/min => 220C
I 1578.1578.
ReferenceBoatright and Lei, 1999Boatright and Lei, 1999
Comment MSDC-RI MSDC-RI

References

Boatright and Lei, 1999
Boatright, W.L.; Lei, Q., Compounds contributing to the Beany odor of aqueous solutions of soy protein isolates, J. Food Sci., 1999, 64, 4, 667-670, https://doi.org/10.1111/j.1365-2621.1999.tb15107.x . [all data]