Diadamantane

Gas phase thermochemistry data

Data compiled by: Hussein Y. Afeefy, Joel F. Liebman, and Stephen E. Stein

Quantity Value Units Method Reference Comment
Δfgas-34.87 ± 0.58kcal/molCcbClark, Knox, et al., 1979Gas flow technique for Hs, see Clark, Knox, et al., 1975 AND Carson, Laye, et al., 1971

Condensed phase thermochemistry data

Data compiled as indicated in comments:
ALS - Hussein Y. Afeefy, Joel F. Liebman, and Stephen E. Stein
DH - Eugene S. Domalski and Elizabeth D. Hearing

Quantity Value Units Method Reference Comment
Δfsolid-57.82 ± 0.55kcal/molCcbClark, Knox, et al., 1979Gas flow technique for Hs, see Clark, Knox, et al., 1975 AND Carson, Laye, et al., 1971; ALS
Quantity Value Units Method Reference Comment
Δcsolid-1942.06 ± 0.61kcal/molCcbClark, Knox, et al., 1979Gas flow technique for Hs, see Clark, Knox, et al., 1975 AND Carson, Laye, et al., 1971; Corresponding Δfsolid = -57.81 kcal/mol (simple calculation by NIST; no Washburn corrections); ALS
Quantity Value Units Method Reference Comment
solid,1 bar47.839cal/mol*KN/AWestrum, McKervey, et al., 1978crystaline, III phase; DH

Constant pressure heat capacity of solid

Cp,solid (cal/mol*K) Temperature (K) Reference Comment
52.63295.56Spinella, Andrews, et al., 1978crystaline, III phase; T = 295 to 540 K. Value is unsmoothed experimental datum.; DH
53.351298.15Westrum, McKervey, et al., 1978crystaline, III phase; T = 5 to 350 K. Data between 350 and 540 K taken from other work.; DH

References

Clark, Knox, et al., 1979
Clark, T.; Knox, T.M.O.; McKervey, M.A.; Mackle, H.; Rooney, J.J., Thermochemistry of bridged-ring substances. Enthalpies of formation of some diamondoid hydrocarbons and of perhydroquinacene. Comparisons with data from empirical force field calculations, J. Am. Chem. Soc., 1979, 101, 2404-2410. [all data]

Clark, Knox, et al., 1975
Clark, T.; Knox, T.M.; Mackle, H.; McKervey, M.A.; Rooney, J.J., Calorimetric evaluation of enthalpies of formation of some bridged-ring hydrocarbons. Comparison with data from empirical force field calculations., J. Am. Chem. Soc., 1975, 97, 3835-3836. [all data]

Carson, Laye, et al., 1971
Carson, A.S.; Laye, P.G.; Steele, W.V.; Johnson, D.E.; McKervey, M.A., The enthalpy of formation of diamantane, J. Chem. Thermodyn., 1971, 3, 915-918. [all data]

Westrum, McKervey, et al., 1978
Westrum, E.F., Jr.; McKervey, M.A.; Andrews, J.T.S.; Fort, R.C., Jr.; Clark, T., Heat capacity and thermodynamic properties of diamantane from 5 to 540 K, J. Chem. Thermodynam., 1978, 10, 959-965. [all data]

Spinella, Andrews, et al., 1978
Spinella, G.M.; Andrews, J.T.S.; Bacon, W.E., Diamantane: heat capacity (300 to 540 K) and thermodynamics of transition and fusion, J. Chem. Thermodynam., 1978, 10, 1023-1032. [all data]