Benzene,1-methyl-4-(1-methylethoxy)-

Gas phase ion energetics data

Data compiled by: Sharon G. Lias, Rhoda D. Levin, and Sherif A. Kafafi

Ionization energy determinations

IE (eV) Method Reference Comment
8.09PEDewar, Ernstbrunner, et al., 1974Vertical value

References

Dewar, Ernstbrunner, et al., 1974
Dewar, P.S.; Ernstbrunner, E.; Gilmore, J.R.; Godfrey, M.; Mellor, J.M., Conformational analysis of alkyl aryl ethers and alkyl aryl sulphides by photoelectron spectroscopy, Tetrahedron, 1974, 30, 2455. [all data]