Silane, (methoxymethyl)trimethoxy-

Kovats' RI, non-polar column, isothermal

View large format table.

Column type Active phase Temperature (C) I Reference Comment
CapillaryApiezon L160.720.9Peetre, 1974Column length: 50. m; Column diameter: 0.25 mm

Kovats' RI, non-polar column, custom temperature program

View large format table.

Column type Active phase I Reference Comment
CapillaryApiezon L713.Peetre, 1974Column length: 50. m; Column diameter: 0.25 mm; Program: not specified

References

Peetre, 1974
Peetre, I.-B., Gas chromatographic investigation of organometallic compounds and their carbon analogues. II. Improved method for calculating retention indices of tetraalkoxysilanes, J. Chromatogr., 1974, 88, 2, 311-321, https://doi.org/10.1016/S0021-9673(00)83155-6 . [all data]