2-(1,1-Dimethylethyl)-6-(1-methylethyl)phenol

Condensed phase thermochemistry data

Data compiled by: Hussein Y. Afeefy, Joel F. Liebman, and Stephen E. Stein

Quantity Value Units Method Reference Comment
Δfliquid-330.kJ/molCcbBertholon, Giray, et al., 1971
Quantity Value Units Method Reference Comment
Δcliquid-7644.kJ/molCcbBertholon, Giray, et al., 1971Corresponding Δfliquid = -330. kJ/mol (simple calculation by NIST; no Washburn corrections)

Van Den Dool and Kratz RI, non-polar column, temperature ramp

View large format table.

Column type Active phase I Reference Comment
CapillaryOV-11382.7Gautzsch and Zinn, 19968. K/min; Tstart: 35. C; Tend: 300. C

References

Bertholon, Giray, et al., 1971
Bertholon, G.; Giray, M.; Perrin, R.; Vincent-Falquet-Berny, M.F., No. 532. - Etude physicochimique des phenols. OX. - Ethanlpies de combustion et energies de resonance des alcoyl et aryphenols, Bull. Soc. Chim. France, 1971, 3180-3187. [all data]