4,4'-Dinitrohydrazobenzene

Condensed phase thermochemistry data

Data compiled by: Hussein Y. Afeefy, Joel F. Liebman, and Stephen E. Stein

Quantity Value Units Method Reference Comment
Δfsolid109.6kJ/molCmCole and Gilbert, 1951
Quantity Value Units Method Reference Comment
Δcsolid-6260.9kJ/molCmCole and Gilbert, 1951

References

Cole and Gilbert, 1951
Cole, L.G.; Gilbert, E.C., The heats of combustion of some nitrogen compounds and the apparent energy of the N-N bond, J. Am. Chem. Soc., 1951, 73, 5423-5427. [all data]