6-Octenoic acid, 3,7-dimethyl-, methyl ester

Normal alkane RI, non-polar column, custom temperature program

Data compiled by: NIST Mass Spectrometry Data Center, William E. Wallace, director

Column type CapillaryCapillaryCapillaryCapillaryCapillary
Active phase DB-1DB-5CP Sil 8 CBCP Sil 8 CBCP Sil 8 CB
Column length (m) 30.50.50.50.50.
Carrier gas HeHeliumHeliumHeHe
Substrate
Column diameter (mm) 0.250.320.320.320.32
Phase thickness (μm) 0.250.250.250.250.25
Program 45C => 3C/min => 175C => 15C/min => 300C (10min)60 0C (1 min) 5 0C/min -> 160 0C 10 0C/min -> 250 0C60 0C (2 min) 5 0C/min -> 160 0C (1 min) 10 0C/min -> 280 0C (3 min)50C(5min) => 2C/min => 90C => 15C/min => 240C(4min)50C(5min) => 2C/min => 90C => 15C/min => 240C(4min)
I 1245.1261.1261.1261.1261.
ReferenceFerreira, Meireles de Sousa, et al., 2007Nivinsliene, Butkiene, et al., 2007Radusiene, Judzentiene, et al., 2007Butkienë, Nivinskienë, et al., 2005Butkienë, Nivinskienë, et al., 2004
Comment MSDC-RI MSDC-RI MSDC-RI MSDC-RI MSDC-RI
Column type Capillary
Active phase DB-1
Column length (m) 30.
Carrier gas H2
Substrate
Column diameter (mm) 0.25
Phase thickness (μm) 0.25
Program 45C => 3C/min => 175C => 15C => 240C(10min)
I 1245.
Referenceda Silva, Figueiredo, et al., 1998
Comment MSDC-RI

Kovats' RI, non-polar column, temperature ramp

Data compiled by: NIST Mass Spectrometry Data Center, William E. Wallace, director

Column type CapillaryCapillaryCapillaryCapillaryCapillary
Active phase SE-54DB-5SE-54DB-5DB-5
Column length (m) 30.30.30.30.30.
Carrier gas HeHe HeHe
Substrate
Column diameter (mm) 0.260.260.260.260.26
Phase thickness (μm) 0.250.250.250.250.25
Tstart (C) 60.60.60.60.60.
Tend (C) 246.240.246.246.246.
Heat rate (K/min) 3.3.3.3.3.
Initial hold (min)
Final hold (min)
I 1261.1261.1261.1261.1261.
ReferenceAdams, 2000Adams, 2000, 2Adams, 2000, 3Adams, 2000, 4Adams, 1999
Comment MSDC-RI MSDC-RI MSDC-RI MSDC-RI MSDC-RI

Normal alkane RI, polar column, custom temperature program

Data compiled by: NIST Mass Spectrometry Data Center, William E. Wallace, director

Column type CapillaryCapillary
Active phase DB-WaxHP-Innowax FSC
Column length (m) 30.60.
Carrier gas Helium
Substrate
Column diameter (mm) 0.250.25
Phase thickness (μm) 0.250.25
Program not specified60C(10min) => 4C/min => 220C(10min) => 1C/min => 240C
I 1596.1571.
ReferenceZhao, Xu, et al., 2009Tabanca, Kirimer, et al., 2001
Comment MSDC-RI MSDC-RI

Kovats' RI, non-polar column, custom temperature program

View large format table.

Column type Active phase I Reference Comment
CapillaryDB-51261.Adams, 199830. m/0.26 mm/0.25 μm; Program: not specified

Kovats' RI, polar column, isothermal

View large format table.

Column type Active phase Temperature (C) I Reference Comment
PackedCarbowax 20M150.1582.ter Heide, de Valois, et al., 1975Embacel; Column length: 2.5 m

Van Den Dool and Kratz RI, non-polar column, temperature ramp

View large format table.

Column type Active phase I Reference Comment
CapillaryHP-51261.Benzo, Gilardoni, et al., 200730. m/0.25 mm/0.25 μm, He, 40. C @ 1. min, 5. K/min, 250. C @ 10. min
CapillaryDB-51261.Su, Ho, et al., 200630. m/0.25 mm/0.25 μm, He, 50. C @ 2. min, 5. K/min; Tend: 250. C
CapillaryDB-11258.Dob T., Berramdane T., et al., 200530. m/0.32 mm/0.25 μm, N2, 50. C @ 3. min, 2. K/min, 260. C @ 5. min

Van Den Dool and Kratz RI, non-polar column, custom temperature program

View large format table.

Column type Active phase I Reference Comment
CapillaryHP-5MS1262.1Andriamaharavo, 201430. m/0.25 mm/0.25 μm, He; Program: 60C (1 min) => 5 C/min => 210C => 10 C/min => 280C (15 min)
CapillaryBPX-51264.Cardeal, da Silva, et al., 200630. m/0.25 mm/0.25 μm; Program: 35C(5min) => 3C/min => 210C => 40C/min => 240C (4min)

Van Den Dool and Kratz RI, polar column, temperature ramp

View large format table.

Column type Active phase I Reference Comment
CapillaryZB-Wax1596.Ledauphin, Saint-Clair, et al., 200430. m/0.25 mm/0.15 μm, He, 35. C @ 5. min, 5. K/min, 220. C @ 10. min

Normal alkane RI, non-polar column, temperature ramp

View large format table.

Column type Active phase I Reference Comment
CapillaryDB-5 MS1268.Chalchat, Figueredo, et al., 201025. m/0.30 mm/0.25 μm, Helium, 3. K/min; Tstart: 50. C; Tend: 240. C
CapillaryDB-5 MS1281.Mesa-Arango, Betancur-Galvis, et al., 201060. m/0.25 mm/0.25 μm, Helium, 40. C @ 15. min, 5. K/min, 250. C @ 15. min
CapillaryDB-51250.El-Massry, El-Ghorab, et al., 200930. m/0.25 mm/0.25 μm, Helium, 3. K/min, 220. C @ 40. min; Tstart: 35. C
CapillaryDB-51259.Havlik, Kokoska, et al., 200630. m/0.25 mm/0.25 μm, He, 3. K/min, 250. C @ 10. min; Tstart: 50. C
CapillaryCP Sil 5 CB1246.Lis and Milczarek, 200630. m/0.32 mm/0.25 μm, N2, 4. K/min; Tstart: 50. C; Tend: 300. C
CapillaryHP-5MS1260.Mimica-Dukic, Bozin, et al., 200430. m/0.25 mm/0.25 μm, He, 3. K/min; Tstart: 60. C; Tend: 280. C
CapillaryDB-11242.Shahmir, Ahmadi, et al., 200360. m/0.25 mm/0.25 μm, He, 4. K/min; Tstart: 50. C; Tend: 280. C
CapillaryDB-51262.Zoghbi, Andrade, et al., 200330. m/0.25 mm/0.25 μm, He, 3. K/min; Tstart: 60. C; Tend: 240. C
CapillarySE-541263.Kollmannsberger, Nitz, et al., 199230. m/0.25 mm/0.25 μm, Hydrogen, 60. C @ 5. min, 2. K/min, 250. C @ 2. min

Normal alkane RI, polar column, temperature ramp

View large format table.

Column type Active phase I Reference Comment
CapillaryDB-Wax1604.Zhao, Xu, et al., 200930. m/0.25 mm/0.25 μm, Helium, 40. C @ 2. min, 3. K/min, 230. C @ 5. min
CapillaryCarbowax 20M1562.Kollmannsberger, Nitz, et al., 199245. m/0.32 mm/1.0 μm, Hydrogen, 60. C @ 5. min, 2. K/min; Tend: 200. C

References

Ferreira, Meireles de Sousa, et al., 2007
Ferreira, N.J.; Meireles de Sousa, I.G.; Luís, T.C.; Currais, A.J.M.; Figueiredo, C.; Cost, M.M.; Lima, A.S.B.; Santos, P.A.G.; Barroso, J.G.; Pedro, L.G.; Scheffer, J.J.C., Pittosporum undulatum Vent. grown in Portugal: secretory structures, seasonal variation and enantiomeric composition of its essential oil, Flavour Fragr. J., 2007, 22, 1, 1-9, https://doi.org/10.1002/ffj.1748 . [all data]

Nivinsliene, Butkiene, et al., 2007
Nivinsliene, O.; Butkiene, R.; Gudalevic, A.; Mockute, D.; Meskauskiene, V.; Grigaliunaite, B., Influence of urban environment on chemical composition of Tilia cordata essential oil, Chemija, 2007, 18, 1, 44-49. [all data]

Radusiene, Judzentiene, et al., 2007
Radusiene, J.; Judzentiene, A.; Peciulyte, D.; Janulis, V., Essential Oil Composition and Antimicrobial Assay of Acorus calamus Leaves from Different Wild Populations, Plant Genetic Resources: Characterization and Utilization, 2007, 5, 1, 37-44, https://doi.org/10.1017/S1479262107390928 . [all data]

Butkienë, Nivinskienë, et al., 2005
Butkienë, R.; Nivinskienë, O.; Mockutë, D., α-Pinene chemotype of leaf (needle) essential oils of Juniperus communis L. growing wild in Vilnius district, Chemija, 2005, 16, 1, 53-60. [all data]

Butkienë, Nivinskienë, et al., 2004
Butkienë, R.; Nivinskienë, O.; Mockutë, D., Chemical composition of unripe and ripe berry essential oils of Juniperus communis L. growing wild in Vilnius district, Chemija, 2004, 15, 4, 57-63. [all data]

da Silva, Figueiredo, et al., 1998
da Silva, J.A.; Figueiredo, A.C.; Barroso, J.G.; Pedro, L.G.; Gomes, M.A.; Fontinha, S.S.; Scheffer, J.J.C., Composition of the essential oil of Melanoselinum decipiens (Schrad. Wendl.) Hoffm., an endemic species of the Madeira and Azores archipelagos, Flavour Fragr. J., 1998, 13, 2, 90-92, https://doi.org/10.1002/(SICI)1099-1026(199803/04)13:2<90::AID-FFJ700>3.0.CO;2-D . [all data]