5-Phenylvaleric acid

Phase change data

Data compiled as indicated in comments:
BS - Robert L. Brown and Stephen E. Stein
AC - William E. Acree, Jr., James S. Chickos

Quantity Value Units Method Reference Comment
Δsub119.4 ± 1.1kJ/molMEMonte and Hillesheim, 2001Based on data from 315. - 327. K.; AC

Reduced pressure boiling point

Tboil (K) Pressure (bar) Reference Comment
450.70.017Aldrich Chemical Company Inc., 1990BS

Enthalpy of sublimation

ΔsubH (kJ/mol) Temperature (K) Method Reference Comment
118.5 ± 0.8321.MEMonte and Hillesheim, 2001Based on data from 315. - 327. K.; AC

Enthalpy of fusion

ΔfusH (kJ/mol) Temperature (K) Method Reference Comment
23.4332.DSCMonte and Hillesheim, 2001AC

References

Monte and Hillesheim, 2001
Monte, Manuel J.S.; Hillesheim, Dorothea M., Thermodynamic Study on the Sublimation of 2-Phenylacetic, 4-Phenylbutyric, and 5-Phenylvaleric Acid, J. Chem. Eng. Data, 2001, 46, 6, 1601-1604, https://doi.org/10.1021/je010153h . [all data]

Aldrich Chemical Company Inc., 1990
Aldrich Chemical Company Inc., Catalog Handbook of Fine Chemicals, Aldrich Chemical Company, Inc., Milwaukee WI, 1990, 1. [all data]