1-Diethylaminoethylidenecrhomium pentacarbonyl

Gas phase ion energetics data

Data compiled by: Henry M. Rosenstock, Keith Draxl, Bruce W. Steiner, and John T. Herron

Ionization energy determinations

IE (eV) Method Reference
7.01EIMuller and Connor, 1969

References

Muller and Connor, 1969
Muller, J.; Connor, J.A., Massenspektroskopische Untersuchungen an Pentacarbonylchrom-carben-Komplexen, Chem. Ber., 1969, 102, 1148. [all data]