[1,2,4,5]Tetrazino[1,6-a:4,3-a']diisoquinoline

Gas phase ion energetics data

Data compiled by: Sharon G. Lias, John E. Bartmess, Joel F. Liebman, John L. Holmes, Rhoda D. Levin, and W. Gary Mallard

Ionization energy determinations

IE (eV) Method Reference Comment
6.0PELecoultre and Heilbronner, 1987
6.44PELecoultre and Heilbronner, 1987Vertical value

References

Lecoultre and Heilbronner, 1987
Lecoultre, J.; Heilbronner, E., 153. The ionization energies of tetrazinodi(heteroarenes), Helv. Chim. Acta, 1987, 70, 1661. [all data]