CAS Reg. No. 226407-20-1

Reaction thermochemistry data

Data compiled by: John E. Bartmess

Individual Reactions

(CAS Reg. No. 226407-20-1 • 4294967295Fluoromethylidyne) + Fluoromethylidyne = CAS Reg. No. 226407-20-1

By formula: (CAS Reg. No. 226407-20-1 • 4294967295CF) + CF = CAS Reg. No. 226407-20-1

Quantity Value Units Method Reference Comment
Δr21.9 ± 1.1kcal/molCIDTJesinger and Squires, 1999gas phase

References

Jesinger and Squires, 1999
Jesinger, R.A.; Squires, R.R., Carbyne thermochemistry from energy-resolved collision-induced dissociation. The heats of formation of CH, CF, and CCl, Int. J. Mass Spectrom., 1999, 187, 745-757, https://doi.org/10.1016/S1387-3806(98)14182-9 . [all data]