Bicyclo[3.2.0]hept-1-ene

Reaction thermochemistry data

Data compiled by: Hussein Y. Afeefy, Joel F. Liebman, and Stephen E. Stein

Individual Reactions

Hydrogen + Bicyclo[3.2.0]hept-1-ene = Bicyclo[3.2.0]heptane

By formula: H2 + C7H10 = C7H12

Quantity Value Units Method Reference Comment
Δr-165. ± 1.kJ/molChydRoth, Adamczak, et al., 1991liquid phase

References

Roth, Adamczak, et al., 1991
Roth, W.R.; Adamczak, O.; Breuckmann, R.; Lennartz, H.-W.; Boese, R., Die Berechnung von Resonanzenergien; das MM2ERW-Kraftfeld, Chem. Ber., 1991, 124, 2499-2521. [all data]