2-Heneicosanone

Phase change data

Data compiled as indicated in comments:
TRC - Thermodynamics Research Center, NIST Boulder Laboratories, Chris Muzny director
AC - William E. Acree, Jr., James S. Chickos

Quantity Value Units Method Reference Comment
Tfus334.KN/AVilalta, Hammond, et al., 1993Uncertainty assigned by TRC = 0.1 K; TRC

Enthalpy of fusion

ΔfusH (kJ/mol) Temperature (K) Method Reference Comment
77.65333.9DSCVilalta, Hammond, et al., 1993, 2AC

In addition to the Thermodynamics Research Center (TRC) data available from this site, much more physical and chemical property data is available from the following TRC products:

References

Vilalta, Hammond, et al., 1993
Vilalta, P.M.; Hammond, G.S.; Weiss, R.G., Determination of the solubilization sites afforded by smectic phases of (perfluorodecyl)decane [F(CF2)10(CH2)10H] to some linear ketones undergoing the Norrish II photoreactions, Langmuir, 1993, 9, 7, 1910, https://doi.org/10.1021/la00031a046 . [all data]

Vilalta, Hammond, et al., 1993, 2
Vilalta, Patricia M.; Hammond, George S.; Weiss, Richard G., Determination of the solubilization sites afforded by smectic phases of (perfluorodecyl)decane [F(CF2)10(CH2)10H] to some linear ketones undergoing the Norrish II photoreactions, Langmuir, 1993, 9, 7, 1910-1921, https://doi.org/10.1021/la00031a046 . [all data]