Benzene, (2-isothiocyanatoethyl)-

Van Den Dool and Kratz RI, non-polar column, temperature ramp

Data compiled by: NIST Mass Spectrometry Data Center, William E. Wallace, director

Column type Capillary
Active phase HP-5MS
Column length (m) 30.
Carrier gas He
Substrate
Column diameter (mm) 0.25
Phase thickness (μm) 0.25
Tstart (C) 60.
Tend (C) 275.
Heat rate (K/min) 4.
Initial hold (min)
Final hold (min)
I 1465.
ReferenceAfsharypuor and Suleimany, 2002
Comment MSDC-RI

References

Afsharypuor and Suleimany, 2002
Afsharypuor, S.; Suleimany, M., Volatile oil constituents of Brassica oleracea var. gongylodes seeds, J. Essent. Oil Res., 2002, 14, 1, 18-19, https://doi.org/10.1080/10412905.2002.9699748 . [all data]