2(3H)-Benzothiazolethione, 3-methyl-

Gas phase ion energetics data

Data compiled by: Sharon G. Lias, Rhoda D. Levin, and Sherif A. Kafafi

Ionization energy determinations

IE (eV) Method Reference
7.81PEGuimon, Arbelot, et al., 1975

References

Guimon, Arbelot, et al., 1975
Guimon, C.; Arbelot, M.; Pfister-Guillouzo, G., Structure electronique de derives sulfures-VIII. Spectres photoelectroniques et electroniques d'J. Heterocycl. Chem. thiocarbonyles benzo-substitues, Spectrochim. Acta Part A, 1975, 31, 985. [all data]