Strontium, doubly charged positive ion

Reaction thermochemistry data

Data compiled by: Michael M. Meot-Ner (Mautner) and Sharon G. Lias

Individual Reactions

(Sr+2 • 10Water) + Water = (Sr+2 • 11Water)

By formula: (Sr+2 • 10H2O) + H2O = (Sr+2 • 11H2O)

Quantity Value Units Method Reference Comment
Δr14. ± 3.kcal/molHPMSBlades, Jayaweera, et al., 1990gas phase; electospray, Entropy change calculated or estimated
Quantity Value Units Method Reference Comment
Δr23.cal/mol*KN/ABlades, Jayaweera, et al., 1990gas phase; electospray, Entropy change calculated or estimated

Free energy of reaction

ΔrG° (kcal/mol) T (K) Method Reference Comment
7.2300.HPMSBlades, Jayaweera, et al., 1990gas phase; electospray, Entropy change calculated or estimated

(Sr+2 • 11Water) + Water = (Sr+2 • 12Water)

By formula: (Sr+2 • 11H2O) + H2O = (Sr+2 • 12H2O)

Quantity Value Units Method Reference Comment
Δr14. ± 3.kcal/molHPMSBlades, Jayaweera, et al., 1990gas phase; electospray, Entropy change calculated or estimated
Quantity Value Units Method Reference Comment
Δr23.cal/mol*KN/ABlades, Jayaweera, et al., 1990gas phase; electospray, Entropy change calculated or estimated

Free energy of reaction

ΔrG° (kcal/mol) T (K) Method Reference Comment
6.9300.HPMSBlades, Jayaweera, et al., 1990gas phase; electospray, Entropy change calculated or estimated

(Sr+2 • 9Water) + Water = (Sr+2 • 10Water)

By formula: (Sr+2 • 9H2O) + H2O = (Sr+2 • 10H2O)

Quantity Value Units Method Reference Comment
Δr14. ± 3.kcal/molHPMSBlades, Jayaweera, et al., 1990gas phase; electospray, Entropy change calculated or estimated
Quantity Value Units Method Reference Comment
Δr23.cal/mol*KN/ABlades, Jayaweera, et al., 1990gas phase; electospray, Entropy change calculated or estimated

Free energy of reaction

ΔrG° (kcal/mol) T (K) Method Reference Comment
7.3300.HPMSBlades, Jayaweera, et al., 1990gas phase; electospray, Entropy change calculated or estimated

(Sr+2 • 8Water) + Water = (Sr+2 • 9Water)

By formula: (Sr+2 • 8H2O) + H2O = (Sr+2 • 9H2O)

Quantity Value Units Method Reference Comment
Δr15. ± 3.kcal/molHPMSBlades, Jayaweera, et al., 1990gas phase; electospray, Entropy change calculated or estimated
Quantity Value Units Method Reference Comment
Δr23.cal/mol*KN/ABlades, Jayaweera, et al., 1990gas phase; electospray, Entropy change calculated or estimated

Free energy of reaction

ΔrG° (kcal/mol) T (K) Method Reference Comment
8.0300.HPMSBlades, Jayaweera, et al., 1990gas phase; electospray, Entropy change calculated or estimated

References

Blades, Jayaweera, et al., 1990
Blades, A.T.; Jayaweera, P.; Ikonomou, M.G.; Kebarle, P., Studies of Alkaline - Earth and Transition - Metal M++ Gas - Phase Ion Chemistry, J. Chem. Phys., 1990, 92, 10, 5900, https://doi.org/10.1063/1.458360 . [all data]