Isopropyl isothiocyanate

Kovats' RI, non-polar column, isothermal

View large format table.

Column type Active phase Temperature (C) I Reference Comment
PackedUCW-98120.817.9Rajniaková and Floch, 1993N2, Chromosorb WAW DNCS; Column length: 1.8 m

Van Den Dool and Kratz RI, non-polar column, custom temperature program

View large format table.

Column type Active phase I Reference Comment
CapillaryDB-5837.Afsharypuor, Jeiran, et al., 199825. m/0.25 mm/0.25 μm, He; Program: 60C => 3C/min => 106C => 6C/min => 280C

Van Den Dool and Kratz RI, polar column, temperature ramp

View large format table.

Column type Active phase I Reference Comment
CapillaryDB-Wax1177.Cha, Kim, et al., 199860. m/0.25 mm/0.25 μm, 40. C @ 5. min, 3. K/min, 200. C @ 60. min

Normal alkane RI, non-polar column, temperature ramp

View large format table.

Column type Active phase I Reference Comment
CapillaryBP-1835.Dehshahri, Afsharypuor, et al., 201230. m/0.25 mm/0.25 μm, Nitrogen, 4. K/min; Tstart: 60. C; Tend: 275. C

Normal alkane RI, non-polar column, custom temperature program

View large format table.

Column type Active phase I Reference Comment
CapillaryDB-5837.Afsharypuor and Arefian, 199925. m/0.25 mm/0.25 μm, Helium; Program: 60 0C 3 0C/min -> 106 0C 6 0C/min -> 280 0C

References

Rajniaková and Floch, 1993
Rajniaková, O.; Floch, L., Study of the properties of ethyl isothiocyanatocarboxylates by means of gas chromatography and mass spectroscopy, Chem. Pap., 1993, 47, 2, 106-108. [all data]

Afsharypuor, Jeiran, et al., 1998
Afsharypuor, S.; Jeiran, K.; Jazy, A.A., First investigation of the flavour profiles of the leaf, ripe fruit and root of Capparis spinosa var. mucronifolia from Iran, Pharm. Acta Helv., 1998, 72, 5, 307-309, https://doi.org/10.1016/S0031-6865(97)00023-X . [all data]

Cha, Kim, et al., 1998
Cha, Y.J.; Kim, H.; Cadwallader, K.R., Aroma-active compounds in Kimchi during fermentation, J. Agric. Food Chem., 1998, 46, 5, 1944-1953, https://doi.org/10.1021/jf9706991 . [all data]

Dehshahri, Afsharypuor, et al., 2012
Dehshahri, S.; Afsharypuor, S.; Asghari, G.; Mohagheghzadeh, A., Determination of volatile glucosinolate degradation products in seed coat, stem and in vitro cultures of Moringa peregrina (Forssk.) Fiori, Res. Pharmaceutical Sci., 2012, 7, 1, 51-56. [all data]

Afsharypuor and Arefian, 1999
Afsharypuor, S.; Arefian, J., Stachidryne and volatile isothiocyanates from the unripe fruit of Capparis spinosa L., DARU, 1999, 7, 2, 11-13. [all data]