1,24-Tetracosanediol

Phase change data

Data compiled by: William E. Acree, Jr., James S. Chickos

Enthalpy of fusion

ΔfusH (kJ/mol) Temperature (K) Method Reference
51.2381.5DSCOgawa and Nakamura, 1999

References

Ogawa and Nakamura, 1999
Ogawa, Yoshihiro; Nakamura, Naotake, Phase Transitions of Pure Long-Chain .ALPHA.,.OMEGA.-Alkanediols from C13 to C24., Bull. Chem. Soc. Jpn., 1999, 72, 5, 943-946, https://doi.org/10.1246/bcsj.72.943 . [all data]