(2-2-Dimethyl-6,6,6-trifluoro-3,5-hexanedionato)lithium

Phase change data

Data compiled by: William E. Acree, Jr., James S. Chickos

Enthalpy of sublimation

ΔsubH (kJ/mol) Temperature (K) Reference Comment
182.0 ± 2.3453. - 523.Filatov, Sysoev, et al., 2006Value calculated assuming the vapor phase is a dimer

References

Filatov, Sysoev, et al., 2006
Filatov, E.S.; Sysoev, S.V.; Zelenina, Ludmila N.; Chusova, Tamara P.; Logvinenko, V.A.; Semyannikov, P.P.; Igumenov, I.K., Thermodynamic study of a series lithium β-diketonates, J Therm Anal Calorim, 2006, 86, 2, 537-539, https://doi.org/10.1007/s10973-006-7470-0 . [all data]