Quinoline, 2,6,8-trimethyl-

Kovats' RI, non-polar column, isothermal

View large format table.

Column type Active phase Temperature (C) I Reference Comment
CapillaryOV-101140.1461.Dmitrikov and Nabivach, 1995He
CapillaryOV-101160.1475.Dmitrikov and Nabivach, 1995He
CapillaryOV-101140.1461.Berlizov, Nabivach, et al., 1987N2; Column length: 50. m; Column diameter: 0.22 mm
CapillaryOV-101160.1475.Berlizov, Nabivach, et al., 1987N2; Column length: 50. m; Column diameter: 0.22 mm

Kovats' RI, polar column, isothermal

View large format table.

Column type Active phase Temperature (C) I Reference Comment
CapillaryPEG-20M140.2018.Dmitrikov and Nabivach, 1995He
CapillaryPEG-20M160.2040.Dmitrikov and Nabivach, 1995He
CapillaryPEG-20M140.2018.Berlizov, Nabivach, et al., 1987N2; Column length: 30. m; Column diameter: 0.25 mm
CapillaryPEG-20M160.2042.Berlizov, Nabivach, et al., 1987N2; Column length: 30. m; Column diameter: 0.25 mm
CapillaryPEG-20M140.2018.Buryan, Macák, et al., 1987N2; Column length: 30. m; Column diameter: 0.25 mm
CapillaryPEG-20M160.2042.Buryan, Macák, et al., 1987N2; Column length: 30. m; Column diameter: 0.25 mm

References

Dmitrikov and Nabivach, 1995
Dmitrikov, V.P.; Nabivach, V.M., Physico-chemical regularities of quinoline bases retention in gas chromatography, Coke Chem. (Engl. Transl.), 1995, 8, 27-34. [all data]

Berlizov, Nabivach, et al., 1987
Berlizov, Yu.S.; Nabivach, V.M.; Mitrikov, V.P., Capillary gas chromatography of alkylquinolines, Zh. Anal. Khim., 1987, 62, 6, 1119-1124. [all data]

Buryan, Macák, et al., 1987
Buryan, P.; Macák, J.; Triska, J.; Vodicka, L.; Berlizov, Yu.S.; Dmitrikov, V.P.; Nabivach, V.M., Kováts retention indices of alkylquinolines on capillary columns, J. Chromatogr., 1987, 391, 89-96, https://doi.org/10.1016/S0021-9673(01)94307-9 . [all data]