indium phosphide

Gas phase ion energetics data

Data compiled by: John E. Bartmess

Electron affinity determinations

EA (eV) Method Reference Comment
1.845 ± 0.010ZEKEGomez, Taylor, et al., 2002
1.950 ± 0.050LPESXu, Debeer, et al., 1994
1.88 ± 0.10LPESAsmis, Taylor, et al., 1999

References

Gomez, Taylor, et al., 2002
Gomez, H.; Taylor, T.R.; Zhao, Y.; Neumark, D.M., Spectroscopy of the low-lying states of the group III-V diatomics, AlP, GaP, InP, and GaAs via anion photodetachment spectroscopy, J. Chem. Phys., 2002, 117, 19, 8644-8656, https://doi.org/10.1063/1.1514050 . [all data]

Xu, Debeer, et al., 1994
Xu, C.S.; Debeer, E.; Arnold, D.W.; Arnold, C.C.; Neumark, D.M., Anion photoelectron spectroscopy of small indium phosphide clusters (InxPy(-);x,y=1-4), J. Chem. Phys., 1994, 101, 6, 5406, https://doi.org/10.1063/1.467393 . [all data]

Asmis, Taylor, et al., 1999
Asmis, K.R.; Taylor, T.R.; Neumark, D.M., Electronic structure of indium phosphide clusters: anion photoelectron spectroscopy of InxPx- and Inx+1Px- (x=1-13) clusters, Chem. Phys. Lett., 1999, 308, 5-6, 347-354, https://doi.org/10.1016/S0009-2614(99)00671-5 . [all data]