Boron monochloride monofluoride

Gas phase thermochemistry data

Quantity Value Units Method Reference Comment
Δfgas-313.80kJ/molReviewChase, 1998Data last reviewed in December, 1964
Quantity Value Units Method Reference Comment
gas,1 bar264.64J/mol*KReviewChase, 1998Data last reviewed in December, 1964

Gas Phase Heat Capacity (Shomate Equation)

Cp° = A + B*t + C*t2 + D*t3 + E/t2
H° − H°298.15= A*t + B*t2/2 + C*t3/3 + D*t4/4 − E/t + F − H
S° = A*ln(t) + B*t + C*t2/2 + D*t3/3 − E/(2*t2) + G
    Cp = heat capacity (J/mol*K)
    H° = standard enthalpy (kJ/mol)
    S° = standard entropy (J/mol*K)
    t = temperature (K) / 1000.

View plot Requires a JavaScript / HTML 5 canvas capable browser.

View table.

Temperature (K) 298. - 2000.2000. - 6000.
A 37.8656258.07057
B 33.994160.058389
C -20.70570-0.009874
D 4.3176790.000591
E -0.340388-3.235864
F -327.5670-339.4617
G 299.2949322.9295
H -313.8004-313.8004
ReferenceChase, 1998Chase, 1998
Comment Data last reviewed in December, 1964 Data last reviewed in December, 1964

Gas phase ion energetics data

Data compiled by: Sharon G. Lias, Rhoda D. Levin, and Sherif A. Kafafi

Ionization energy determinations

IE (eV) Method Reference
11. ± 1.EISrivastava and Farber, 1971

References

Chase, 1998
Chase, M.W., Jr., NIST-JANAF Themochemical Tables, Fourth Edition, J. Phys. Chem. Ref. Data, Monograph 9, 1998, 1-1951. [all data]

Srivastava and Farber, 1971
Srivastava, R.D.; Farber, M., Thermodynamic properties of the B-Cl-F system from mass spectrometer investigations, J. Chem. Soc. Faraday Trans., 1971, 67, 2298. [all data]