Phosphorodifluoridic acid, methyl ester

Gas phase ion energetics data

Data compiled by: Sharon G. Lias, Rhoda D. Levin, and Sherif A. Kafafi

Ionization energy determinations

IE (eV) Method Reference Comment
12.64PEFurlani and Andreocci, 1977Vertical value

References

Furlani and Andreocci, 1977
Furlani, C.; Andreocci, M.V., Valence-shell photoionization spectra of some methyldihalogenophosphates, J. Chem. Soc. Dalton Trans., 1977, 7, 673. [all data]