Hexamethyldigermoxane

Phase change data

Data compiled by: William E. Acree, Jr., James S. Chickos

Enthalpy of vaporization

ΔvapH (kcal/mol) Temperature (K) Method Reference Comment
10.5318.SGGriffiths and Onyszchuk, 1961Based on data from 291. - 345. K.

References

Griffiths and Onyszchuk, 1961
Griffiths, J.E.; Onyszchuk, M., ORGANOGERMANIUM COMPOUNDS: PART I. THE INTERACTION OF HEXAMETHYLDIGERMOXANE AND TRIMETHYLMETHOXYGERMANE WITH BORON TRIFLUORIDE, Can. J. Chem., 1961, 39, 2, 339-347, https://doi.org/10.1139/v61-040 . [all data]