Iridium, hydrotetrakis(phosphorus trifluoride)-

Gas phase ion energetics data

Data compiled as indicated in comments:
B - John E. Bartmess
LLK - Sharon G. Lias, Rhoda D. Levin, and Sherif A. Kafafi

Ionization energy determinations

IE (eV) Method Reference Comment
9.82PEHead, Nixon, et al., 1975Vertical value; LLK

De-protonation reactions

F12IrP4- + Hydrogen cation = HF12IrP4

By formula: F12IrP4- + H+ = HF12IrP4

Quantity Value Units Method Reference Comment
Δr<1293. ± 13.kJ/molIMRBMiller, Kawamura, et al., 1990gas phase; Between FSO3H and CF3SO3H; B

Reaction thermochemistry data

Data compiled by: John E. Bartmess

Individual Reactions

F12IrP4- + Hydrogen cation = HF12IrP4

By formula: F12IrP4- + H+ = HF12IrP4

Quantity Value Units Method Reference Comment
Δr<309.0 ± 3.0kcal/molIMRBMiller, Kawamura, et al., 1990gas phase; Between FSO3H and CF3SO3H

References

Head, Nixon, et al., 1975
Head, R.A.; Nixon, J.F.; Sharp, G.J.; Clark, R.J., Photoelectron spectroscopic study of metal trifluorophosphine and hydridotrifluorophosphine complexes, J. Chem. Soc. Dalton Trans., 1975, 2054. [all data]

Miller, Kawamura, et al., 1990
Miller, A.E.S.; Kawamura, A.R.; Miller, T.M., Effects of Metal and Ligand Substitutions on Gas-Phase Acidities of Transition-Metal Hydrides, J. Am. Chem. Soc., 1990, 112, 1, 457, https://doi.org/10.1021/ja00157a075 . [all data]