Cyclohexane, nonadecyl-

Phase change data

Data compiled as indicated in comments:
TRC - Thermodynamics Research Center, NIST Boulder Laboratories, Chris Muzny director
AC - William E. Acree, Jr., James S. Chickos

Quantity Value Units Method Reference Comment
Tfus315.7KN/AMeyer and Meyer, 1983Uncertainty assigned by TRC = 0.05 K; by DSC; TRC
Tfus303.1KN/AMeyer and Meyer, 1983Metastable crystal phase; Uncertainty assigned by TRC = 0.14 K; by DSC; TRC

Enthalpy of vaporization

ΔvapH (kcal/mol) Temperature (K) Reference Comment
24.57445.Dykyj, Svoboda, et al., 1999Based on data from 430. - 686. K.; AC

Enthalpy of fusion

ΔfusH (kcal/mol) Temperature (K) Method Reference Comment
19.1315.7DSCYoung and Schall, 2001AC
18.59316.2DSCSirota, Herhold, et al., 2000AC
18.8313.2DSCYoung, Dollimore, et al., 2000AC
18.6317.N/AMiyajima, Enomoto, et al., 1991AC

In addition to the Thermodynamics Research Center (TRC) data available from this site, much more physical and chemical property data is available from the following TRC products:

References

Meyer and Meyer, 1983
Meyer, E.F.; Meyer, M.C., Solid-Liquid Behaviur of Nonadecylcyclohexane and Nonadecylbenzene, J. Chem. Eng. Data, 1983, 28, 148-50. [all data]

Dykyj, Svoboda, et al., 1999
Dykyj, J.; Svoboda, J.; Wilhoit, R.C.; Frenkel, M.L.; Hall, K.R., Vapor Pressure of Chemicals: Part A. Vapor Pressure and Antoine Constants for Hydrocarbons and Sulfur, Selenium, Tellurium and Hydrogen Containing Organic Compounds, Springer, Berlin, 1999, 373. [all data]

Young and Schall, 2001
Young, P.H.; Schall, C.A., Cycloalkane solubility determination through differential scanning calorimetry, Thermochimica Acta, 2001, 367-368, 387-392, https://doi.org/10.1016/S0040-6031(00)00658-4 . [all data]

Sirota, Herhold, et al., 2000
Sirota, E.B.; Herhold, A.B.; Varma-Nair, M., Structure, thermodynamics, and transition kinetics of nonadecylcyclohexane, J. Chem. Phys., 2000, 113, 18, 8225, https://doi.org/10.1063/1.1314859 . [all data]

Young, Dollimore, et al., 2000
Young, P.H.; Dollimore, D.; Schall, C.A., Organometallics, 2000, 62, 1, 163-171, https://doi.org/10.1023/A:1010123130508 . [all data]

Miyajima, Enomoto, et al., 1991
Miyajima, Seiichi; Enomoto, Takehiko; Kusanagi, Tomohiro; Chiba, Takehiko, Terminal Polar Substituent Effect on the Liquid Crystalline Properties of a Series of 4-Octyloxy-N-(4-substituted benzylidene)anilines., Bull. Chem. Soc. Jpn., 1991, 64, 5, 1679-1681, https://doi.org/10.1246/bcsj.64.1679 . [all data]