Manganate(-1), carbonyl(η5-2,4-cyclopentadien-1-yl)-

Ion clustering data

Data compiled by: John E. Bartmess

Clustering reactions

C6H5MnO- + Carbon monoxide = C6H5MnO-

By formula: C6H5MnO- + CO = C6H5MnO-

Quantity Value Units Method Reference Comment
Δr20.9 ± 2.1kJ/molN/ASunderlin and Squires, 1999gas phase

C6H5MnO- + Carbon monoxide = C7H5MnO2-

By formula: C6H5MnO- + CO = C7H5MnO2-

Quantity Value Units Method Reference Comment
Δr32.6 ± 2.5kJ/molN/ASunderlin and Squires, 1999gas phase

References

Sunderlin and Squires, 1999
Sunderlin, L.S.; Squires, R.R., Bond strengths in cyclopentadienyl metal carbonyl anions, Int. J. Mass Spectrom., 1999, 183, 149-161, https://doi.org/10.1016/S1387-3806(98)14230-6 . [all data]