Vanadate(-1), dicarbonyl(η5-2,4-cyclopentadien-1-yl)-

Reaction thermochemistry data

Data compiled by: John E. Bartmess

Individual Reactions

C7H5O2V- + Carbon monoxide = C8H5O3V-

By formula: C7H5O2V- + CO = C8H5O3V-

Quantity Value Units Method Reference Comment
Δr7.60 ± 0.60kcal/molN/ASunderlin and Squires, 1999gas phase

C7H5O2V- + Carbon monoxide = C7H5O2V-

By formula: C7H5O2V- + CO = C7H5O2V-

Quantity Value Units Method Reference Comment
Δr7.90 ± 0.70kcal/molN/ASunderlin and Squires, 1999gas phase

References

Sunderlin and Squires, 1999
Sunderlin, L.S.; Squires, R.R., Bond strengths in cyclopentadienyl metal carbonyl anions, Int. J. Mass Spectrom., 1999, 183, 149-161, https://doi.org/10.1016/S1387-3806(98)14230-6 . [all data]