[1R-(1α,2α,5α)]-4,6,6-trimethylbicyclo[3.1.1]hept-3-en-2-ol

Phase change data

Data compiled by: William E. Acree, Jr., James S. Chickos

Quantity Value Units Method Reference Comment
Δvap13.1kcal/molGCHoskovec, Grygarová, et al., 2005Based on data from 323. - 433. K.

References

Hoskovec, Grygarová, et al., 2005
Hoskovec, Michal; Grygarová, Dana; Cvacka, Josef; Streinz, Ludvík; Zima, Jirí; Verevkin, Sergey P.; Koutek, Bohumír, Determining the vapour pressures of plant volatiles from gas chromatographic retention data, Journal of Chromatography A, 2005, 1083, 1-2, 161-172, https://doi.org/10.1016/j.chroma.2005.06.006 . [all data]