5-Methyltricosane

Phase change data

Data compiled by: William E. Acree, Jr., James S. Chickos

Enthalpy of vaporization

ΔvapH (kJ/mol) Temperature (K) Method Reference Comment
79.6518.AStephenson and Malanowski, 1987Based on data from 503. - 653. K. See also Dykyj, Svoboda, et al., 1999 and Terres, Brinkmann, et al., 1959.

Normal alkane RI, non-polar column, custom temperature program

Data compiled by: NIST Mass Spectrometry Data Center, William E. Wallace, director

Column type CapillaryCapillaryCapillary
Active phase  HP-5CP Sil 5 CB
Column length (m)  30.25.
Carrier gas  H2He
Substrate
Column diameter (mm)  0.320.32
Phase thickness (μm)   0.2
Program not specified60C (2min) => 20C/min => 180C => 3C/min => 310 C (10min)50C => 20C/min => 130C => 4C/min => 300C (20min)
I 2351.2354.2346.
ReferenceSteiger, Peschke, et al., 2007Juárez, Carlson, et al., 2002Kenig, Sinninghe Damsté, et al., 1995
Comment MSDC-RI MSDC-RI MSDC-RI

References

Stephenson and Malanowski, 1987
Stephenson, Richard M.; Malanowski, Stanislaw, Handbook of the Thermodynamics of Organic Compounds, 1987, https://doi.org/10.1007/978-94-009-3173-2 . [all data]

Dykyj, Svoboda, et al., 1999
Dykyj, J.; Svoboda, J.; Wilhoit, R.C.; Frenkel, M.L.; Hall, K.R., Vapor Pressure of Chemicals: Part A. Vapor Pressure and Antoine Constants for Hydrocarbons and Sulfur, Selenium, Tellurium and Hydrogen Containing Organic Compounds, Springer, Berlin, 1999, 373. [all data]

Terres, Brinkmann, et al., 1959
Terres, E.; Brinkmann, L.; Fischer, D.; Hüllstrung, D.; Loz, W.; Weisbrod, G., Brennst.-Chem., 1959, 40, 279. [all data]