C6H8O2

Gas phase ion energetics data

Data compiled by: John E. Bartmess

De-protonation reactions

C6H7O2- + Hydrogen cation = C6H8O2

By formula: C6H7O2- + H+ = C6H8O2

Quantity Value Units Method Reference Comment
Δr1434. ± 12.kJ/molG+TSGraul, Schnute, et al., 1990gas phase
Quantity Value Units Method Reference Comment
Δr1405. ± 12.kJ/molCIDCGraul, Schnute, et al., 1990gas phase

References

Graul, Schnute, et al., 1990
Graul, S.T.; Schnute, M.E.; Squires, R.R., Gas-Phase Acidities of Carboxylic Acids and Alcohols from Collision-Induced Dissociation of Dimer Cluster Ions, Int. J. Mass Spectrom. Ion Proc., 1990, 96, 2, 181, https://doi.org/10.1016/0168-1176(90)87028-F . [all data]