Benzenecarbothioamide

Gas phase thermochemistry data

Data compiled by: Hussein Y. Afeefy, Joel F. Liebman, and Stephen E. Stein

Quantity Value Units Method Reference Comment
Δfgas147.8 ± 2.7kJ/molCcrRibeiro Da Silva, Souza, et al., 1989
Δfgas131.0 ± 1.3kJ/molCcrSabbah and Gomez, 1982

Condensed phase thermochemistry data

Data compiled as indicated in comments:
ALS - Hussein Y. Afeefy, Joel F. Liebman, and Stephen E. Stein
DH - Eugene S. Domalski and Elizabeth D. Hearing

Quantity Value Units Method Reference Comment
Δfsolid44.4 ± 1.5kJ/molCcrRibeiro Da Silva, Souza, et al., 1989ALS
Δfsolid33.8 ± 1.1kJ/molCcrSabbah and Gomez, 1982ALS
Quantity Value Units Method Reference Comment
Δcsolid-4401.4 ± 1.1kJ/molCcrRibeiro Da Silva, Souza, et al., 1989ALS
Δcsolid-4390.78 ± 0.99kJ/molCcrSabbah and Gomez, 1982ALS

Constant pressure heat capacity of solid

Cp,solid (J/mol*K) Temperature (K) Reference Comment
152.8298.Sabbah and Torres-Gomez, 1982Cp given as 1.114 J K-1 g-1.; DH

References

Ribeiro Da Silva, Souza, et al., 1989
Ribeiro Da Silva, M.D.M.C.; Souza, P.; Pilcher, G., Enthalpies of combustion of thiobenzamide, N,N-dimethylthiobenzamide, and N,N-diethylthiobenzamide, J. Chem. Thermodyn., 1989, 21, 173-178. [all data]

Sabbah and Gomez, 1982
Sabbah, R.; Gomez, L.A.T., Thermodynamique de substances soufrees. III. Etude thermochimique de la thioacetamide et de la thiobenzamide, Thermochim. Acta, 1982, 52, 285-295. [all data]

Sabbah and Torres-Gomez, 1982
Sabbah, R.; Torres-Gomez, L.A., Thermodynamics of sulfur-containing compounds. III. Thermochemical study of thioacetamide and thiobenzamide, Thermochim. Acta, 1982, 52, 285-295. [all data]