Cyclodeca[b]furan-2(3H)-one, 3a,4,5,8,9,11a-hexahydro-3,6,10-trimethyl-, [3S-(3R*,3aR*,6E,10E,11aR*)]-

Normal alkane RI, non-polar column, temperature ramp

View large format table.

Column type Active phase I Reference Comment
CapillaryOV-11898.Nibret and Wink, 200930. m/0.25 mm/0.25 μm, Helium, 40. C @ 2. min, 4. K/min, 300. C @ 10. min

References

Nibret and Wink, 2009
Nibret, E.; Wink, M., Volatile components of four Ethiopian Artemisia species extracts and their in vitro antipatrypanosomal and cytotoxic activities, Phytomedicine, 2009, 00, 0, 000-000. [all data]