cadmium distearate

Phase change data

Data compiled by: Eugene S. Domalski and Elizabeth D. Hearing

Enthalpy of fusion

ΔfusH (kJ/mol) Temperature (K) Reference Comment
19.600380.Konkoly-Thege, Ruff, et al., 1978Crystal-mesophase(1).

Entropy of fusion

ΔfusS (J/mol*K) Temperature (K) Reference Comment
51.380.Konkoly-Thege, Ruff, et al., 1978Crystal-mesophase(1).

Enthalpy of phase transition

ΔHtrs (kJ/mol) Temperature (K) Initial Phase Final Phase Reference Comment
22.800386.2liquidliquidKonkoly-Thege, Ruff, et al., 1978
26.200391.2liquidliquidKonkoly-Thege, Ruff, et al., 1978

Entropy of phase transition

ΔStrs (J/mol*K) Temperature (K) Initial Phase Final Phase Reference Comment
59.386.2liquid, Mesophase(1)liquid, mesophase(2)Konkoly-Thege, Ruff, et al., 1978
67.391.2liquid, Mesophase(2)liquid, liquidKonkoly-Thege, Ruff, et al., 1978

References

Konkoly-Thege, Ruff, et al., 1978
Konkoly-Thege, I.; Ruff, I.; Adeosun, S.O.; Sime, S.J., Properties of molten carboxylates. Part 6. A quantitative differential thermal analysis study of phase transitions in some zinc and cadmium carboxylates, Thermochim. Acta, 1978, 24, 89-96. [all data]