ethylenediamine dihydrothiocyanate

Phase change data

Data compiled by: Thermodynamics Research Center, NIST Boulder Laboratories, Chris Muzny director

Quantity Value Units Method Reference Comment
Tfus417.7KN/AHouse, McCormick, et al., 1980Uncertainty assigned by TRC = 0.5 K

In addition to the Thermodynamics Research Center (TRC) data available from this site, much more physical and chemical property data is available from the following TRC products:

References

House, McCormick, et al., 1980
House, J.E.; McCormick, D.; Jagiella, J.A., Studies on amine hydrothiocyanates: III. heats of fusion., Thermochim. Acta, 1980, 38, 349-50. [all data]