Uranium monoxide monosulfide

Gas phase ion energetics data

Data compiled by: Henry M. Rosenstock, Keith Draxl, Bruce W. Steiner, and John T. Herron

Ionization energy determinations

IE (eV) Method Reference
~8. ± 0.5EICater, Rauh, et al., 1968

References

Cater, Rauh, et al., 1968
Cater, E.D.; Rauh, E.G.; Thorn, R.J., Thermochemistry of UOS; evaporation of US-UO2 mixtures; on the attainment of equilibrium in Knudsen cells, J. Chem. Phys., 1968, 49, 5244. [all data]