Benzenethanamine, 3,4,5-trimethoxy-α-methyl-(.+/-.)-

Gas phase ion energetics data

Data compiled as indicated in comments:
LLK - Sharon G. Lias, Rhoda D. Levin, and Sherif A. Kafafi

Ionization energy determinations

IE (eV) Method Reference Comment
8.16 ± 0.06PEDomelsmith and Houk, 1978Vertical value; LLK

References

Domelsmith and Houk, 1978
Domelsmith, L.N.; Houk, K.N., Photoelectron spectroscopic studies of hallucinogens: The use of ionization potentials in QSAR, NIDA Res. Monogr., 1978, 22, 423. [all data]