3-Undecanone

Phase change data

Data compiled as indicated in comments:
BS - Robert L. Brown and Stephen E. Stein
TRC - Thermodynamics Research Center, NIST Boulder Laboratories, Chris Muzny director

Quantity Value Units Method Reference Comment
Tboil500.2KN/AWeast and Grasselli, 1989BS
Tboil500.KN/APickard and Kenyon, 1913Uncertainty assigned by TRC = 4. K; TRC
Quantity Value Units Method Reference Comment
Tfus285.7KN/AVon Braun and Teuffert, 1929Uncertainty assigned by TRC = 2. K; TRC
Tfus277.7KN/AThoms and Mannich, 1903Uncertainty assigned by TRC = 2. K; TRC
Quantity Value Units Method Reference Comment
Tc684.6KN/APulliam, Gude, et al., 1995Uncertainty assigned by TRC = 1.3 K; TRC
Quantity Value Units Method Reference Comment
ρc1.44mol/lN/APulliam, Gude, et al., 1995Uncertainty assigned by TRC = 0.04 mol/l; TRC

Reduced pressure boiling point

Tboil (K) Pressure (bar) Reference Comment
378.20.015Weast and Grasselli, 1989BS

In addition to the Thermodynamics Research Center (TRC) data available from this site, much more physical and chemical property data is available from the following TRC products:

Van Den Dool and Kratz RI, non-polar column, temperature ramp

View large format table.

Column type Active phase I Reference Comment
CapillaryHP-5MS1255.Saroglou, Marin, et al., 200730. m/0.25 mm/0.25 μm, He, 60. C @ 5. min, 4. K/min; Tend: 280. C
CapillaryBPX-51298.Dickschat, Wenzel, et al., 200425. m/0.22 mm/0.25 μm, He, 50. C @ 5. min, 5. K/min; Tend: 300. C

Van Den Dool and Kratz RI, polar column, temperature ramp

View large format table.

Column type Active phase I Reference Comment
CapillaryZB-Wax1586.Brunton, Cronin, et al., 200260. m/0.32 mm/0.25 μm, He, 3. K/min; Tstart: 40. C; Tend: 220. C
CapillarySupelcowax-101571.Vejaphan, Hsieh, et al., 198860. m/0.25 mm/0.25 μm, 40. C @ 5. min, 2. K/min, 175. C @ 20. min

Normal alkane RI, non-polar column, temperature ramp

View large format table.

Column type Active phase I Reference Comment
CapillaryHP-5 MS1283.Lazarevic, Radulovic, et al., 201030. m/0.25 mm/0.25 μm, Helium, 5. K/min; Tstart: 70. C; Tend: 290. C
CapillaryDB-51283.Smelcerovic, Spiteller, et al., 200730. m/0.25 mm/0.25 μm, He, 10. K/min, 320. C @ 4. min; Tstart: 60. C
CapillaryCross-Linked Methylsilicone1269.Bravo and Hotchkiss, 1993He, 35. C @ 3. min, 4. K/min; Column length: 25. m; Column diameter: 0.32 mm; Tend: 225. C

Normal alkane RI, non-polar column, custom temperature program

View large format table.

Column type Active phase I Reference Comment
CapillarySE-301268.Vinogradov, 2004Program: not specified

Normal alkane RI, polar column, custom temperature program

View large format table.

Column type Active phase I Reference Comment
CapillaryCarbowax 20M1555.Vinogradov, 2004Program: not specified

References

Weast and Grasselli, 1989
CRC Handbook of Data on Organic Compounds, 2nd Editon, Weast,R.C and Grasselli, J.G., ed(s)., CRC Press, Inc., Boca Raton, FL, 1989, 1. [all data]

Pickard and Kenyon, 1913
Pickard, R.H.; Kenyon, J., Investigations on the dependence of rotatory power on chemical constitution: IV the rotations of the normal secondary alcohols of the formula c(2)h(5).ch(oh).r, J. Chem. Soc., 1913, 103, 1923-59. [all data]

Von Braun and Teuffert, 1929
Von Braun, J.; Teuffert, W., Chem. Ber., 1929, 62, 235. [all data]

Thoms and Mannich, 1903
Thoms, H.; Mannich, C., Chem. Ber., 1903, 36, 2544. [all data]

Pulliam, Gude, et al., 1995
Pulliam, M.K.; Gude, M.T.; Teja, A.S., Critical Temperatures and Densities of n-Alkanones, J. Chem. Eng. Data, 1995, 40, 455-8. [all data]