Silane, chloromethyl, diethoxy, methyl

Normal alkane RI, non-polar column, temperature ramp

Data compiled by: NIST Mass Spectrometry Data Center, William E. Wallace, director

Column type Packed
Active phase SE-30
Column length (m) 3.
Carrier gas Helium
Substrate Chromosorb W (80-100 mesh)
Column diameter (mm)
Phase thickness (μm)
Tstart (C) 50.
Tend (C) 220.
Heat rate (K/min) 5.
Initial hold (min) 0.
Final hold (min) 0.
I 960.
ReferenceZenkevich, Shchegolev, et al., 1984
Comment MSDC-RI

References

Zenkevich, Shchegolev, et al., 1984
Zenkevich, I.G.; Shchegolev, A.E.; Finogenov, Yu.; Ivin B.A., Mass Spectrometric Characterization of Alkyl- and Alkoxy(chlormethyl)silanes, VINITI, # 6805-84, 1984, 29. [all data]