2-Octen-1-ol

Normal alkane RI, polar column, custom temperature program

Data compiled by: NIST Mass Spectrometry Data Center, William E. Wallace, director

Column type CapillaryCapillaryCapillaryCapillary
Active phase DB-WaxInnowax FSCHP Innowax FSPDB-Wax
Column length (m) 30.60.60.30.
Carrier gas HeliumHeHeHe
Substrate
Column diameter (mm) 0.320.250.250.25
Phase thickness (μm) 0.250.250.250.25
Program 40 0C (4 min) 3 0C/min -> 50 0C 5 0C/min -> 120 0C 7 0C/min -> 175 0C 10 0C/min -> 230 0C (8 min)60C(10min) => 4C/min => 220C(10min) => 1C/min => 240C60C(10min) => 4C/min => 220C (10min) => 1C/min => 240C25C(8min) => 4C/min => 60C => 6C/min => 160C => 20C/min => 200C
I 1639.1621.1621.1616.
ReferenceYongsheng, Hua, et al., 2008Baser, Özek, et al., 2004Tasdemir, Demirci, et al., 2003Caldentey, Daria Fumi, et al., 1998
Comment MSDC-RI MSDC-RI MSDC-RI MSDC-RI

Normal alkane RI, non-polar column, custom temperature program

Data compiled by: NIST Mass Spectrometry Data Center, William E. Wallace, director

Column type CapillaryCapillary
Active phase HP-1MDN-5
Column length (m) 50.30.
Carrier gas He
Substrate
Column diameter (mm) 0.20.25
Phase thickness (μm) 0.330.25
Program 40C(2min) => 2C/min => 200C => 15C/min => 250C (30min)not specified
I 1045.1066.
ReferenceBarra, Baldovini, et al., 2007Jelen and Grabarkiewicz-Szczesna, 2005
Comment MSDC-RI MSDC-RI

Normal alkane RI, polar column, temperature ramp

Data compiled by: NIST Mass Spectrometry Data Center, William E. Wallace, director

Column type CapillaryCapillaryCapillaryCapillaryCapillary
Active phase AT-WaxBP-20DB-WaxDB-WaxDB-Wax
Column length (m) 60.50.30.30.30.
Carrier gas HeliumH2  Hydrogen
Substrate
Column diameter (mm) 0.250.220.250.250.32
Phase thickness (μm) 0.250.250.250.250.50
Tstart (C) 60.45.30.30.30.
Tend (C) 280.230.250.250.190.
Heat rate (K/min) 4.3.4.4.3.
Initial hold (min)  1.1.1.6.
Final hold (min)  15.
I 1622.1598.1617.1621.1625.
ReferenceKiss, Csoka, et al., 2011La Guerche S., Dauphin B., et al., 2006Tanaka, Yamauchi, et al., 2003Tanaka, Yamauchi, et al., 2003Young, Gilbert, et al., 1996
Comment MSDC-RI MSDC-RI MSDC-RI MSDC-RI MSDC-RI
Column type Capillary
Active phase Carbowax 20M
Column length (m) 150.
Carrier gas He
Substrate
Column diameter (mm) 0.64
Phase thickness (μm)
Tstart (C) 50.
Tend (C) 170.
Heat rate (K/min) 1.
Initial hold (min) 10.
Final hold (min) 60.
I 1610.
ReferenceSeifert and King, 1982
Comment MSDC-RI

References

Yongsheng, Hua, et al., 2008
Yongsheng, T.; Hua, L.; Hua, W.; Li, Z., Volatile composition of young Cabernet Savignon red wine from Changli Counti (China), J. Food Composition and Analysis, 2008, 21, 8, 689-694, https://doi.org/10.1016/j.jfca.2008.05.007 . [all data]

Baser, Özek, et al., 2004
Baser, K.H.C.; Özek, T.; Kirimer, N.; Deliorman, D.; Ergun, F., Composition of the essential oils of Galium aparine L. and Galium odoratum (L.) Scop. from Turkey, J. Essent. Oil Res., 2004, 16, 4, 305-307, https://doi.org/10.1080/10412905.2004.9698728 . [all data]

Tasdemir, Demirci, et al., 2003
Tasdemir, D.; Demirci, B.; Demirci, F.; Dönmez, A.A.; Baser, K.H.C.; Rüedi, P., Analysis of the Volatile Components of Five Turkish Rhododendron Species by Headspace Solid-Phase Microextraction and GC-MS (HS-SPME-GC-MS), Z. Naturforsch., 2003, 58c, 797-803. [all data]

Caldentey, Daria Fumi, et al., 1998
Caldentey, P.; Daria Fumi, M.; Mazzoleni, V.; Careri, M., Volatile compounds produced by microorganisms isolated from cork, Flavour Fragr. J., 1998, 13, 3, 185-188, https://doi.org/10.1002/(SICI)1099-1026(199805/06)13:3<185::AID-FFJ723>3.0.CO;2-W . [all data]