Acetylene-d1

Gas phase ion energetics data

Data compiled by: Sharon G. Lias, Rhoda D. Levin, and Sherif A. Kafafi

Ionization energy determinations

IE (eV) Method Reference
11.3 ± 0.1EIReeher, Flesch, et al., 1976

References

Reeher, Flesch, et al., 1976
Reeher, J.R.; Flesch, G.D.; Svec, H.J., The mass spectra and ionization potentials of the neutral fragments produced during the electron bombardment of aromatic compounds, Org. Mass Spectrom., 1976, 11, 154. [all data]