2-Propenoic acid, 2-methyl-, propyl ester

Kovats' RI, non-polar column, isothermal

Data compiled by: NIST Mass Spectrometry Data Center, William E. Wallace, director

Column type CapillaryCapillaryPackedPackedPacked
Active phase OV-101OV-101SE-30SE-30OV-1
Column length (m) 19.19.3.73.7
Carrier gas N2N2HeHe
Substrate   Celatom silanized (62-72 mesh)Celatom silanized (62-72 mesh)
Column diameter (mm) 0.280.28
Phase thickness (μm)
Temperature (C) 120.80.150.150.150.
I 864.868.863.840.856.
ReferenceHorna, Táborský, et al., 1985Horna, Táborský, et al., 1985Ashes and Haken, 1975Ashes and Haken, 1975Ashes and Haken, 1971
Comment MSDC-RI MSDC-RI MSDC-RI MSDC-RI MSDC-RI
Column type PackedPacked
Active phase SE-30SE-30
Column length (m) 3.73.7
Carrier gas
Substrate Celite 560 silanizedCelite 560
Column diameter (mm)
Phase thickness (μm)
Temperature (C) 150.150.
I 856.856.
ReferenceAllen and Haken, 1970Germaine and Haken, 1969
Comment MSDC-RI MSDC-RI

References

Horna, Táborský, et al., 1985
Horna, A.; Táborský, J.; Dufka, O.; Matousek, P.; Churácek, J., Chromatography of monomers. II. Glass capillary gas chromatography of C1-C18 alkyl esters of acrylic and methacrylic acids, J. Chromatogr., 1985, 325, 367-378, https://doi.org/10.1016/S0021-9673(00)96047-3 . [all data]

Ashes and Haken, 1975
Ashes, J.R.; Haken, J.K., Gas chromatography of homologous esters. IX. Structure-retention increments of unsaturated esters, J. Chromatogr., 1975, 111, 1, 171-187, https://doi.org/10.1016/S0021-9673(01)80159-X . [all data]

Ashes and Haken, 1971
Ashes, J.R.; Haken, J.K., Gas chromatography of homologous esters. Part V. Retention of aliphatic esters on non-polar, donar and acceptor stationary phases, J. Chromatogr., 1971, 60, 33-44, https://doi.org/10.1016/S0021-9673(00)95527-4 . [all data]

Allen and Haken, 1970
Allen, I.D.; Haken, J.K., Gas chromatography of homologous esters. Part IV. Influence of stationary phase polarity on retention of unsaturated esters, J. Chromatogr., 1970, 51, 415-422, https://doi.org/10.1016/S0021-9673(01)96890-6 . [all data]

Germaine and Haken, 1969
Germaine, R.W.; Haken, J.K., Gas chromatography of homologous esters. Part 2. Unsaturated esters, J. Chromatogr., 1969, 43, 43-47, https://doi.org/10.1016/S0021-9673(00)99163-5 . [all data]