Fluorodiiodoborane

Gas phase ion energetics data

Data compiled by: Henry M. Rosenstock, Keith Draxl, Bruce W. Steiner, and John T. Herron

Ionization energy determinations

IE (eV) Method Reference
9.69 ± 0.06EILappert, Litzow, et al., 1968

References

Lappert, Litzow, et al., 1968
Lappert, M.F.; Litzow, M.R.; Pedley, J.B.; Riley, P.N.K.; Tweedale, A., Bonding studies of compounds of boron and the group IV elements. Part II. Ionisation potentials of boron halides and mixed halides by electron impact and by molecular orbital calculations, J. Chem. Soc., 1968, (A), 3105. [all data]