methyl perfluoroisopropyl ether

Phase change data

Data compiled by: Thermodynamics Research Center, NIST Boulder Laboratories, Chris Muzny director

Quantity Value Units Method Reference Comment
Tboil302.56KN/ASako, Sato, et al., 1996Uncertainty assigned by TRC = 0.1 K
Quantity Value Units Method Reference Comment
Tc433.30KN/ASako, Sato, et al., 1996Uncertainty assigned by TRC = 0.08 K
Quantity Value Units Method Reference Comment
Pc25.53barN/ASako, Sato, et al., 1996Uncertainty assigned by TRC = 0.06 bar
Quantity Value Units Method Reference Comment
ρc2.71mol/lN/ASako, Sato, et al., 1996Uncertainty assigned by TRC = 0.02 mol/l

In addition to the Thermodynamics Research Center (TRC) data available from this site, much more physical and chemical property data is available from the following TRC products:

References

Sako, Sato, et al., 1996
Sako, T.; Sato, M.; Nakazawa, N.; Oowa, M.; Yasumoto, M.; Ito, H.; Yamashita, S., Critical Properties of Fluorinated Ethers, J. Chem. Eng. Data, 1996, 41, 802-805. [all data]