1-(6-Methyl-2-pyrazinyl)-1-ethanone

Normal alkane RI, polar column, custom temperature program

Data compiled by: NIST Mass Spectrometry Data Center, William E. Wallace, director

Column type CapillaryCapillary
Active phase DB-WaxInnowax
Column length (m) 30.30.
Carrier gas HydrogenHelium
Substrate
Column diameter (mm) 0.250.25
Phase thickness (μm) 0.250.50
Program 44 0C 3 0C/min -> 170 0C 8 0C/min -> 250 0C40 0C (2 min) 10 0C/min -> 100 0C 3 0C/min -> 160 0C 5 0C/min -> 260 0C (10 min)
I 1679.1694.
ReferenceGonzalez-Rios, Suarez-Quiroz, et al., 2007Ito and Mori, 2004
Comment MSDC-RI MSDC-RI

Van Den Dool and Kratz RI, non-polar column, temperature ramp

Data compiled by: NIST Mass Spectrometry Data Center, William E. Wallace, director

Column type CapillaryCapillaryCapillary
Active phase DB-1DB-1SE-30
Column length (m) 60.50.50.
Carrier gas HeHe
Substrate
Column diameter (mm) 0.320.320.32
Phase thickness (μm) 1.1.050.25
Tstart (C) 40.40.50.
Tend (C) 220.260.240.
Heat rate (K/min) 2.2.4.
Initial hold (min) 5.
Final hold (min)  40.
I 1088.1093.1080.
ReferenceKim, 2001Izzo and Ho, 1991Misharina, Golovnya, et al., 1991
Comment MSDC-RI MSDC-RI MSDC-RI

References

Gonzalez-Rios, Suarez-Quiroz, et al., 2007
Gonzalez-Rios, O.; Suarez-Quiroz, M.L.; Boulanger, R.; Barel, M.; Guyot, B.; Guiraud, J.-P.; Schorr-Galindo, S., Impact of ecological post-harvest processing of coffee aroma: II Roasted coffee., J. Food Composition Analysis, 2007, 20, 3-4, 297-307, https://doi.org/10.1016/j.jfca.2006.12.004 . [all data]

Ito and Mori, 2004
Ito, K.; Mori, M., Formation of pyrazines in aqueous maltose/glucose/fructose-glutamide model systems upon heating at below 100 0C, Food Sci. Technol. Res., 2004, 10, 2, 199-204, https://doi.org/10.3136/fstr.10.199 . [all data]